Economic Indicators Ontology
type: Ontology
abstract: This ontology provides the parameters which make up the various types of market economic indicators, along with basic facts about these such as the economies or countries they apply to.
license: https://opensource.org/licenses/MIT
imports: FunctionalEntities
imports: Publishers
imports: GovernmentEntities
imports: LegalPersons
imports: FinancialInstruments
imports: RegistrationAuthorities
imports: FinancialProductsAndServices
imports: CurrencyAmount
imports: People
imports: ClassificationSchemes
imports: Documents
imports: BusinessDates
imports: FinancialDates
imports: FormalOrganizations
imports: Parties
imports: Roles
imports: Addresses
imports: Locations
imports: ProductsAndServices
imports: QuantitiesAndUnits
imports: Relations
imports: Analytics
imports: AnnotationVocabulary
imports: Indicators
imports: Classifiers
imports: Collections
imports: ContextualDesignators
imports: DatesAndTimes
version IRI: EconomicIndicators
change note: The https://spec.edmcouncil.org/fibo/ontology/IND/20140601/EconomicIndicators/EconomicIndicators.rdf version of this ontology was modified per the issue resolutions identified in the FIBO IND 1.0 FTF 1 report.
change note: The https://spec.edmcouncil.org/fibo/ontology/IND/20150501/EconomicIndicators/EconomicIndicators.rdf version of this ontology was modified per the issue resolutions identified in the FIBO IND 1.0 FTF 3 report.
change note: The https://spec.edmcouncil.org/fibo/ontology/IND/20160801/EconomicIndicators/EconomicIndicators.rdf version of this ontology was modified per the FIBO 2.0 RFC. Primary changes include the addition of a number of statistical measures (mean, total, etc.) and their use in existing and new indicators, and the addition of several more economic indicators.
change note: The https://spec.edmcouncil.org/fibo/ontology/IND/20180801/EconomicIndicators/EconomicIndicators.rdf version of this ontology was modified to use natural person rather than legally capable person.
change note: The https://spec.edmcouncil.org/fibo/ontology/IND/20181101/EconomicIndicators/EconomicIndicators.rdf version of this ontology was modified to use hasCoverageArea rather than appliesTo in the restriction on an economic indicator relating it to a statistical area, to reflect use of actualExpression as an annotation rather than datatype property, and to migrate the general statistics concepts to FND (deprecated herein).
change note: The https://spec.edmcouncil.org/fibo/ontology/IND/20190501/EconomicIndicators/EconomicIndicators.rdf version of this ontology was modified to eliminate deprecated elements.
change note: The https://spec.edmcouncil.org/fibo/ontology/IND/20190901/EconomicIndicators/EconomicIndicators.rdf version of this ontology was modified to eliminate duplicatation with concepts in LCC and merge countries with locations in FND.
change note: The https://spec.edmcouncil.org/fibo/ontology/IND/20200301/EconomicIndicators/EconomicIndicators.rdf version of this ontology was modified to reflect the change in name and definition of numeric index to numeric index value in FND.
change note: The https://spec.edmcouncil.org/fibo/ontology/IND/20200401/EconomicIndicators/EconomicIndicators.rdf version of this ontology was modified to add definitions for alternative unemployment calculations and correct a circular property definition.
change note: The https://spec.edmcouncil.org/fibo/ontology/IND/20200901/EconomicIndicators/EconomicIndicators.rdf version of this ontology was modified to eliminate references to external dictionary sites that no longer resolve, added a synonym to fixed basket and eliminated the restriction with respect to date period, which is not the primary concern of a fixed basket, revised the name of the 'goods or services population' to 'goods population' to eliminate a hygiene issue and reflect the synonym of 'basket of goods', and merged the statistical information publisher class from economic indicator publishers into this ontology.
change note: The https://spec.edmcouncil.org/fibo/ontology/IND/2021001/EconomicIndicators/EconomicIndicators.rdf version of this ontology was modified to fix spelling errors.
change note: The https://spec.edmcouncil.org/fibo/ontology/IND/20210301/EconomicIndicators/EconomicIndicators.rdf version of this ontology was modified to eliminate the restriction on economic indicator (and its subclasses) that it has an indicator value - the restriction should be on the quantity value such that the value refers to the indicator it represents, and to revise the definition of civilian non-institutional population to correctly represent civilian non-institutional person (added).
change note: The https://spec.edmcouncil.org/fibo/ontology/IND/20211201/EconomicIndicators/EconomicIndicators.rdf version of this ontology was modified to address text formatting hygiene issues and clean up external links.
change note: The https://spec.edmcouncil.org/fibo/ontology/IND/20220801/EconomicIndicators/EconomicIndicators.rdf version of the ontology was modified to use the Commons Ontology Library (Commons) Annotation Vocabulary rather than the OMG's Specification Metadata vocabulary.
change note: The https://spec.edmcouncil.org/fibo/ontology/IND/20230201/EconomicIndicators/EconomicIndicators.rdf version of this ontology was modified to use the Commons Ontology Library (Commons) rather than the OMG's Languages, Countries and Codes (LCC), eliminating redundancies in FIBO as appropriate.
has maturity level: Release
copyright: Copyright (c) 2014-2023 EDM Council, Inc.
copyright: Copyright (c) 2014-2023 Object Management Group, Inc.

average daily earnings
type: Class
subclass of: average earnings
subclass of: Restriction
  on property: hasReferencePeriod
  has value: daily
definition: a measure of the average daily wage an employee makes over the reporting period
adapted from: http://stats.oecd.org/glossary/detail.asp

average earnings
type: Class
subclass of: Expression
subclass of: economic indicator
subclass of: Restriction
  on property: hasReferencePeriod
  on class: ExplicitRecurrenceInterval
  qualified cardinality: 1
definition: a measure of the average wage an hourly or salaried worker makes in a given period of time
adapted from: http://stats.oecd.org/glossary/detail.asp
explanatory note: Average earnings are typically calculated on an hourly, daily, weekly, or monthly basis. They may be expressed as an amount of money or in terms of a percent change with respect to a prior period, depending on the jurisdiction and report.

average hourly earnings
type: Class
subclass of: average earnings
subclass of: Restriction
  on property: hasReferencePeriod
  has value: hourly
definition: a measure of the average hourly wage an employee makes over the reporting period
adapted from: http://stats.oecd.org/glossary/detail.asp

average monthly earnings
type: Class
subclass of: average earnings
subclass of: Restriction
  on property: hasReferencePeriod
  has value: monthly
definition: a measure of the average monthly wage an employee makes over the reporting period
adapted from: http://stats.oecd.org/glossary/detail.asp

average weekly earnings
type: Class
subclass of: average earnings
subclass of: Restriction
  on property: hasReferencePeriod
  has value: weekly
definition: a measure of the average weekly wage an employee makes over the reporting period
adapted from: http://stats.oecd.org/glossary/detail.asp

capital-labor-energy-materials multifactor productivity
type: Class
subclass of: productivity
definition: a ratio of a quantity index of gross output to a quantity index of combined inputs
abbreviation: KLEMS-MFP
adapted from: http://www.oecd.org/std/productivity-stats/2352458.pdf
explanatory note: Shows the time profile of how productively combined inputs are used to generate gross output. Conceptually, the KLEMS productivity measure captures disembodied technical change. In practice, it reflects also efficiency change, economies of scale, variations in capacity utilisation and measurement errors.
synonym: KLEMS multifactor productivity

capital-labor multifactor productivity (MFP), based on value added
type: Class
subclass of: productivity
definition: a ratio of a quantity index of value added to a quantity index of combined labor and capital input
adapted from: http://www.oecd.org/std/productivity-stats/2352458.pdf
explanatory note: Capital-labour MFP indices show the time profile of how productively combined labour and capital inputs are used to generate value added. Conceptually, capital-labour productivity is not, in general, an accurate measure of technical change. It is, however, an indicator of an industry's capacity to contribute to economy-wide growth of income per unit of primary input. In practice, the measure reflects the combined effects of disembodied technical change, economies of scale, efficiency change, variations in capacity utilisation and measurement errors.

capital productivity, based on value added
type: Class
subclass of: productivity
definition: a ratio of a quantity index of value added to a quantity index of capital input
adapted from: http://www.oecd.org/std/productivity-stats/2352458.pdf
explanatory note: Changes in capital productivity indicate the extent to which output growth can be achieved with lower welfare costs in the form of foregone consumption.
explanatory note: The capital productivity index shows the time profile of how productively capital is used to generate value added. Capital productivity reflects the joint influence of labour, intermediate inputs, technical change, efficiency change, economies of scale, capacity utilisation and measurement errors.

civilian
type: Class
subclass of: LegallyCompetentNaturalPerson
definition: a person that is not a member of the military (i.e., that is not on active duty)
adapted from: U.S. Bureau of Labor Statistics and Statistics Canada reference definitions - https://wiki.edmcouncil.org/pages/viewpage.action?pageId=6358041

civilian labor force
type: Class
subclass of: civilian non-institutional population
disjoint with: population not in the labor force
definition: subset of the civilian, non-institutional population considered to be part of the labor force during a given reporting period
adapted from: U.S. Bureau of Labor Statistics and Statistics Canada reference definitions - https://wiki.edmcouncil.org/pages/viewpage.action?pageId=6358041

civilian labor force participation rate
type: Class
subclass of: Expression
subclass of: economic indicator
subclass of: Restriction
  on property: hasArgument
  some values from: civilian labor force
subclass of: Restriction
  on property: hasArgument
  some values from: civilian non-institutional population
subclass of: Restriction
  on property: appliesTo
  some values from: civilian labor force
definition: economic indicator representing the rate of participation the labor force of a given economy for some specified period
actual expression: civilian labor force ÷ civilian non-institutional population
adapted from: https://www.bls.gov/cps/definitions.htm#lfpr
explanatory note: The labor force participation rate is the percentage of the population that is either employed or unemployed (that is, either working or actively seeking work).

civilian non-institutional person
type: Class
subclass of: LegalWorkingAgePerson
subclass of: civilian
disjoint with: institutional person
definition: legal working-age person that does not live in an institution (for example, a correctional facility, long-term care hospital, or nursing home), and is not on active military duty
adapted from: U.S. Bureau of Labor Statistics and Statistics Canada reference definitions - https://wiki.edmcouncil.org/pages/viewpage.action?pageId=6358041
explanatory note: The working-age population is the total population in a region, within a set range of ages, that is considered to be able and likely to work. The working-age population measure is used to give an estimate of the total number of potential workers within an economy. For example, in the U.S., it is 16, whereas in Canada it is 15.

civilian non-institutional population
type: Class
subclass of: StatisticalUniverse
subclass of: Restriction
  on property: hasMember
  some values from: civilian non-institutional person
definition: statistical universe consisting of people of a certain age who reside in a given region, do not live in institutions (for example, correctional facilities, long-term care hospitals, and nursing homes), and are not on active military duty
scope note: The civilian non-institutional population is typically reported in thousands.
adapted from: U.S. Bureau of Labor Statistics and Statistics Canada reference definitions - https://wiki.edmcouncil.org/pages/viewpage.action?pageId=6358041

combined statistical area
type: Class
subclass of: government-specified statistical area
subclass of: Restriction
  on property: comprises
  on class: government-specified statistical area
  min qualified cardinality: 2
definition: combination of adjacent metropolitan and micropolitan areas with economic ties measured by commuting patterns
abbreviation: CSA
adapted from: Combined statistical area
adapted from: 06282010 metro standards-Complete.pdf
adapted from: 2020-standards-for-delineating-core-based-statistical-areas
explanatory note: These areas that combine retain their own designations as metropolitan or micropolitan statistical areas within the larger combined statistical area.

consumer price index
type: Class
subclass of: Expression
subclass of: economic indicator
subclass of: Restriction
  on property: hasArgument
  some values from: civilian non-institutional population
subclass of: Restriction
  on property: hasArgument
  some values from: fixed basket
subclass of: Restriction
  on property: appliesTo
  some values from: civilian non-institutional population
disjoint with: civilian labor force participation rate
disjoint with: employment-population ratio
disjoint with: gross domestic product
disjoint with: inflation rate
disjoint with: unemployment rate
definition: economic indicator representing a measure of the change over time in the prices of consumer goods and services that households consume
abbreviation: CPI
adapted from: http://unstats.un.org/unsd/nationalaccount/docs/SNA2008.pdf
adapted from: http://www.ilo.org/public/english/bureau/stat/guides/cpi/

daily
type: NamedIndividual
type: ExplicitRecurrenceInterval
definition: an explicit recurrence interval of one day, or 24 hours
has duration value: P1D

discouraged worker population
type: Class
subclass of: marginally attached population
definition: subset of the marginally attached population that have given a job-market related reason for not currently looking for work
adapted from: https://www.bls.gov/news.release/empsit.t15.htm

economic indicator
type: Class
subclass of: ScopedMeasure
subclass of: Restriction
  on property: is seasonally adjusted
  all values from: boolean
subclass of: Restriction
  on property: has series origin
  all values from: Date
subclass of: Restriction
  on property: hasReleaseDate
  on class: Date
  min qualified cardinality: 0
subclass of: Restriction
  on property: hasReleaseDateTime
  min qualified cardinality: 0
  on data range: CombinedDateTime
subclass of: Restriction
  on property: hasReportingPeriod
  some values from: ExplicitDatePeriod
subclass of: Restriction
  on property: hasCoverageArea
  some values from: government-specified statistical area
definition: statistical measure of economic activity that is regular and comparable in the context of a statistical area (region), used for analysis of economic performance and predictions of future performance
example: Example indicators include the average work week, weekly claims for unemployment insurance, new orders, vendor performance, stock prices, and changes in the money supply.
adapted from: Barron's Dictionary of Business and Economic Terms, Fifth Edition, 2012
explanatory note: The two main features of any indicator are the regularity with which they are measured and published, and the fact that they are comparable from one release to the next.

employed population
type: Class
subclass of: civilian labor force
definition: a subset of the civilian labor force considered to be employed during the reporting period
adapted from: U.S. Bureau of Labor Statistics and Statistics Canada reference definitions - https://wiki.edmcouncil.org/pages/viewpage.action?pageId=6358041
explanatory note: There are a number of distinctions with respect to how individuals are counted from country to country, including whether or not they are considered employed if they are on unpaid leave for some reason, and whether or not they are counted multiple times if they have more than one paying job.

employed population part-time
type: Class
subclass of: employed population
definition: subset of the employed population that includes persons that are working fewer than 30 to 35 hours per week based on usual working hours
adapted from: https://stats.oecd.org/Index.aspx
explanatory note: In the U.S., part-time workers are those who usually work fewer than 35 hours per week. See https://www.bls.gov/cps/definitions.htm for additional details.
explanatory note: The definition of part-time varies considerably from country to country according to the OECD. Classification may be based on (1) employee perception, (2) usual working hours, which is the most reliable measure, or (3) actual working hours, which varies due to holidays, illness, etc.
synonym: population employed part-time

employed population part-time for economic reasons
type: Class
subclass of: employed population part-time
subclass of: underemployed population
definition: subset of the employed population that includes persons that are working fewer than 30 to 35 hours per week due to slack work, unfavorable business conditions, inability to find full-time work, and seasonal declines in demand
adapted from: https://stats.oecd.org/Index.aspx
adapted from: https://www.bls.gov/cps/definitions.htm
synonym: involuntary part-time population
synonym: population employed part-time for economic reasons

employed population part-time for non-economic reasons
type: Class
subclass of: employed population part-time
disjoint with: employed population part-time for economic reasons
definition: subset of the employed population that includes persons that are working fewer than 30 to 35 hours per week due to illness or other health or medical limitations, childcare problems, family or personal obligations, being in school or training, retirement or Social Security limits on earnings, and having a job where full-time work is less than 35 hours
adapted from: https://www.bls.gov/cps/definitions.htm
synonym: population employed part-time for non-economic reasons

employed population temporarily not at work
type: Class
subclass of: employed population
definition: subset of the employed population that includes persons that are temporarily absent from work for various reasons
adapted from: https://www.bls.gov/news.release/empsit.t15.htm
explanatory note: This includes persons temporarily not at work because of illness or injury, holiday or vacation, strike or lockout, educational or training leave, maternity or parental leave, reduction in economic activity, temporary disorganisation or suspension of work due to such reasons as bad weather, mechanical or electrical breakdown, or shortage of raw materials or fuels, or other temporary absence with or without leave should be considered as in paid employment provided they had a formal job attachment.

employment-population ratio
type: Class
subclass of: Expression
subclass of: economic indicator
subclass of: Restriction
  on property: hasArgument
  some values from: civilian non-institutional population
subclass of: Restriction
  on property: hasArgument
  some values from: employed population
subclass of: Restriction
  on property: appliesTo
  some values from: employed population
definition: economic indicator representing the ratio of the employed population with respect to the overall civilian non-institutional population of a given economy for some specified period
actual expression: employed population ÷ civilian non-institutional population

enterprise
type: Class
subclass of: FunctionalBusinessEntity
subclass of: institutional unit
subclass of: Class
  union of: Producer
  union of: ServiceProvider
subclass of: Restriction
  on property: hasIdentity
  some values from: LegalPerson
subclass of: Restriction
  on property: isClassifiedBy
  some values from: IndustrySectorClassifier
subclass of: Restriction
  on property: hasConstituent
  some values from: establishment
subclass of: Restriction
  on property: appliesTo
  some values from: Class
    union of: Good
    union of: Service
definition: a functional business entity that produces and/or sells goods or services
adapted from: http://www.bls.gov/opub/hom/glossary.htm#E
explanatory note: An enterprise (a private firm, government, or nonprofit organization) can consist of a single establishment or multiple establishments. All establishments in an enterprise may be classified in one industry (e.g., a chain), or they may be classified in different industries (e.g., a conglomerate).

enterprise population
type: Class
subclass of: StatisticalUniverse
subclass of: Restriction
  on property: hasMember
  some values from: enterprise
definition: a statistical universe consisting of enterprises designed for the purposes of supporting surveys such as those used as the basis for employment and producer price indices

establishment
type: Class
subclass of: institutional unit
subclass of: Restriction
  on property: isConstituentOf
  on class: enterprise
  min qualified cardinality: 0
subclass of: Restriction
  on property: hasAddress
  on class: PhysicalAddress
  qualified cardinality: 1
definition: an enterprise (or part of an enterprise) that operates from a single physical location
adapted from: http://stats.oecd.org/glossary/detail.asp
adapted from: http://www.bls.gov/opub/hom/glossary.htm#E
adapted from: http://www.statcan.gc.ca/eng/concepts/units
explanatory note: The physical location of a certain economic activity - for example, a factory, mine, store, or office. An individual establishment is generally classified by having one NAICS code associated with it for statistical purposes, whereas an enterprise may be classified by multiple NAICS codes. The statistical structure is defined based on the operating structure and the accounting data produced by that entity. A given location may only need to publish revenues, whereas an operating unit (establishment) has employment statistics, etc. An establishment is defined as a producing unit at a single geographical location at which or from which economic activity is conducted and for which, at a minimum, employment data are available. In the case of a home-based business, the actual physical location would be specified as two distinct institutional units - as a household from a personal living and consumer perspective and as an establishment / operating unit due to the statistics required of the business.

establishment employment
type: Class
subclass of: Expression
subclass of: economic indicator
subclass of: Restriction
  on property: hasArgument
  some values from: establishment population
subclass of: Restriction
  on property: appliesTo
  some values from: establishment population
definition: economic indicator representing the total number of persons who work in or for the establishment including working proprietors, active business partners and unpaid family workers, as well as persons working outside the establishment when paid by and under the control of the establishment, for example, sales representatives, outside service engineers and repair and maintenance personnel
adapted from: http://stats.oecd.org/glossary/detail.asp
explanatory note: Also included are salaried managers and salaried directors of incorporated enterprises. The total should include part-time workers and seasonal workers on the payroll, persons on short-term leave (sick leave, maternity leave, annual leave or vacation) and on strike, but not persons on indefinite leave, military leave or pension. Excluded are directors of incorporated enterprises and members of shareholders committees who are paid solely for their attendance at meetings, labour made available to the establishment by other units and charged for, such as contract workers paid through contractors, persons carrying out repair and maintenance work in the establishment on behalf of other units and all homeworkers.
synonym: payroll employment

establishment population
type: Class
subclass of: enterprise population
subclass of: Restriction
  on property: hasMember
  some values from: establishment
definition: a subset of the enterprise population focused on establishments

fixed basket
type: Class
subclass of: Basket
subclass of: DatedStructuredCollection
subclass of: Restriction
  on property: hasConstituent
  some values from: fixed basket constituent
definition: basket of goods and services whose quantity and quality are held fixed for some period of time
adapted from: https://www.imf.org/external/pubs/ft/ppi/2010/manual/ppi.pdf
synonym: basket of goods

fixed basket constituent
type: Class
subclass of: BasketConstituent
subclass of: DatedCollectionConstituent
subclass of: Class
  union of: Good
  union of: Service
equivalent class: Restriction
  on property: isConstituentOf
  some values from: fixed basket
definition: component of a fixed basket

fixed basket population
type: Class
subclass of: StatisticalUniverse
subclass of: Restriction
  on property: hasConstituent
  some values from: Class
    union of: Good
    union of: Service
definition: statistical universe consisting of specific goods and/or services designed for the purposes of supporting surveys such as those used as the basis for price indices
adapted from: https://www.imf.org/external/pubs/ft/ppi/2010/manual/ppi.pdf
synonym: goods and services population
synonym: goods and/or services population

government-specified statistical area
type: Class
subclass of: StatisticalArea
subclass of: Restriction
  on property: isGovernedBy
  some values from: GovernmentBody
definition: statistical area defined by a government agency

gross domestic product
type: Class
subclass of: economic indicator
disjoint with: unemployment rate
definition: economic indicator representing the broadest measure of aggregate economic activity, measuring the total unduplicated market value of all final goods and services produced within a statistical area in a period
abbreviation: GDP
adapted from: BEA's Handbook of Methods for GDP and related national accounts, available at https://www.bea.gov/methodologies/index.htm#national_meth
adapted from: https://en.wikipedia.org/wiki/Gross_domestic_product
adapted from: https://home.treasury.gov/system/files/261/FSOC-2013-Annual-Report.pdf
explanatory note: GDP represents a valuation expressed in terms of the prices actually paid by the purchaser after all applicable taxes and subsidies.
explanatory note: Gross domestic product (GDP) is the value of the goods and services produced by the nation's economy less the value of the goods and services used up in production. GDP is also equal to the sum of personal consumption expenditures, gross private domestic investment, net exports of goods and services, and government consumption expenditures and gross investment. Conceptually, this measure can be arrived at by three separate means: as the sum of goods and services sold to final users, as the sum of income payments and other costs incurred in the production of goods and services, and as the sum of the value added at each stage of production. Although these three ways of measuring GDP are conceptually the same, their calculation may not result in identical estimates of GDP because of differences in data sources, timing, and estimation techniques.

hourly
type: NamedIndividual
type: ExplicitRecurrenceInterval
definition: an explicit recurrence interval of one hour, or 60 minutes
has duration value: P1H

household
type: Class
subclass of: institutional unit
subclass of: Restriction
  on property: isLocatedAt
  on class: housing unit
  max qualified cardinality: 1
subclass of: Restriction
  on property: hasMember
  some values from: Person
definition: individual or small group of persons who occupy a housing unit (such as a house or apartment) as their usual place of residence, who pool some, or all, of their income and wealth and who consume certain types of goods and services collectively, mainly housing and food
adapted from: http://stats.oecd.org/glossary/detail.asp
explanatory note: A household may be either (a) a one-person household, that is to say, a person who makes provision for his or her own food or other essentials for living without combining with any other person to form part of a multi-person household or (b) a multi-person household, that is to say, a group of two or more persons living together who make common provision for food or other essentials for living. The persons in the group may pool their incomes and may, to a greater or lesser extent, have a common budget; they may be related or unrelated persons or constitute a combination of persons both related and unrelated. A household may be located in a housing unit or in a set of collective living quarters such as a boarding house, a hotel or a camp, or may comprise the administrative personnel in an institution. The household may also be homeless.
explanatory note: From the perspective of the U.S Census Bureau, a household includes the related family members and all the unrelated people, if any, such as lodgers, foster children, wards, or employees who share the housing unit. A person living alone in a housing unit, or a group of unrelated people sharing a housing unit such as partners or roomers, is also counted as a household. The count of households excludes group quarters [such as institutional facilities]. There are two major categories of households, 'family' and 'nonfamily'.

housing unit
type: Class
subclass of: PhysicalLocation
subclass of: Restriction
  on property: hasAddress
  all values from: PhysicalAddress
definition: house, an apartment, a mobile home or trailer, a group of rooms, or a single room occupied as separate living quarters, or if vacant, intended for occupancy as separate living quarters
explanatory note: Separate living quarters are those in which the occupants live separately from any other individuals in the building and which have direct access from outside the building or through a common hall. For vacant units, the criteria of separateness and direct access are applied to the intended occupants whenever possible.

inflation rate
type: Class
subclass of: economic indicator
subclass of: Restriction
  on property: appliesTo
  some values from: government-specified statistical area
definition: economic indicator representing a change in prices of goods and services for a specified period, for a given statistical area
editorial note: Always either includes or excludes: Energy prices; Food prices. ALL inflation rates cite whether or not they exclude energy and food prices. If nothing stated it is assumed they include them.
explanatory note: Inflation rate can be used to define changes, from period-to-period, in wage (wage inflation), house prices or producer inputs/outputs. It can be calculated month-over-month and quarter-over-quarter, as well as year-over-year, or on any periodic basis required by the publisher and its community of interest.

input producer price index
type: Class
subclass of: producer price index
definition: economic indicator representing a measure of the rate of change over time in the prices of inputs of goods and services purchased by the producer
abbreviation: input PPI
adapted from: https://www.imf.org/external/pubs/ft/ppi/2010/manual/ppi.pdf

institutional person
type: Class
subclass of: Person
definition: person that resides in an institution for some reason, due, for example, to hospitalization, rehabilitation, or incarceration
adapted from: U.S. Bureau of Labor Statistics and Statistics Canada reference definitions - https://wiki.edmcouncil.org/pages/viewpage.action?pageId=6358041

institutional unit
type: Class
subclass of: FunctionalEntity
subclass of: PartyInRole
definition: party that is capable, in its own right, of owning assets, incurring liabilities, and engaging in economic activities and in transactions with other parties
adapted from: http://stats.oecd.org/glossary/detail.asp
adapted from: http://www.statcan.gc.ca/eng/concepts/units
adapted from: https://www.statcan.gc.ca/en/concepts/ccius/intro
explanatory note: There is a hierarchical relationship between institutional units and establishments. An institutional unit contains one or more entire establishment(s); an establishment belongs to one and only one institutional unit. There are two main types of units in the real world that may qualify as institutional units, namely persons or groups of persons in the form of households, and legal or social entities.

labor productivity, based on gross output
type: Class
subclass of: productivity
definition: ratio of a quantity index of gross output to a quantity index of labor input
adapted from: http://www.oecd.org/std/productivity-stats/2352458.pdf
explanatory note: Gross-output based labour productivity traces the labour requirements per unit of (physical) output. It reflects the change in the input coefficient of labour by industry and can help in the analysis of labour requirements by industry.
explanatory note: Shows the time profile of how productively labour is used to generate gross output. Labour productivity changes reflect the joint influence of changes in capital, intermediate inputs, as well as technical, organisational and efficiency change within and between firms, the influence of economies of scale, varying degrees of capacity utilisation and measurement errors.

labor productivity, based on value added
type: Class
subclass of: productivity
definition: ratio of a quantity index of value added to a quantity index of labor input
adapted from: http://www.oecd.org/std/productivity-stats/2352458.pdf
explanatory note: At the aggregate level, value-added based labour productivity forms a direct link to a widely used measure of living standards, income per capita. Productivity translates directly into living standards, by adjusting for changing working hours, unemployment, labour force participation rates and demographic changes.
explanatory note: Shows the time profile of how productively labour is used to generate value added. Labour productivity changes reflect the joint influence of changes in capital, as well as technical, organisational and efficiency change within and between firms, the influence of economies of scale, varying degrees of capacity utilisation and measurement errors.

marginally attached population
type: Class
subclass of: population not in the labor force
definition: subset of the population that includes people who currently are neither working nor looking for work but indicate that they want and are available for a job and have looked for work sometime in the past 12 months
adapted from: https://www.bls.gov/news.release/empsit.t15.htm

metropolitan statistical area
type: Class
subclass of: government-specified statistical area
definition: one or more adjacent counties or county equivalents that have at least one urban core area of at least 50,000 population, plus adjacent territory that has a high degree of social and economic integration with the core as measured by commuting ties
abbreviation: MSA
adapted from: List of Metropolitan Statistical Areas
adapted from: 06282010 metro standards-Complete.pdf
adapted from: 2020-standards-for-delineating-core-based-statistical-areas

micropolitan statistical area
type: Class
subclass of: government-specified statistical area
definition: one or more adjacent counties or county equivalents that have at least one urban core area of at least 10,000 population but less than 50,000, plus adjacent territory that has a high degree of social and economic integration with the core as measured by commuting ties
abbreviation: μSA
adapted from: List of micropolitan statistical areas
adapted from: 06282010 metro standards-Complete.pdf
adapted from: 2020-standards-for-delineating-core-based-statistical-areas

military person
type: Class
subclass of: LegallyCompetentNaturalPerson
disjoint with: civilian
definition: a person that is a member of the active duty military
adapted from: U.S. Bureau of Labor Statistics and Statistics Canada reference definitions - https://wiki.edmcouncil.org/pages/viewpage.action?pageId=6358041

monthly
type: NamedIndividual
type: ExplicitRecurrenceInterval
definition: an explicit recurrence interval of exactly one (1) month, regardless of the length in days of a given calendar month, but typically 30 days
has duration value: P1M

output producer price index
type: Class
subclass of: producer price index
definition: economic indicator representing a measure of the rate of change over time in the prices of products sold as they leave the producer
abbreviation: output PPI
adapted from: https://www.imf.org/external/pubs/ft/ppi/2010/manual/ppi.pdf

personal consumption expenditures
type: Class
subclass of: economic indicator
definition: economic indicator representing a measure of the value of the goods and services purchased by, or on the behalf of, 'persons'
abbreviation: PCE
adapted from: https://www.bea.gov/data/consumer-spending/main
explanatory note: Personal consumption expenditures consist of purchases of goods and services by households and by nonprofit institutions serving households (NPISHs). These goods and services include imputed expenditures on items such as the services of housing by a homeowner (the equivalent of rent), financial and insurance services for which there is no explicit charge, and medical care provided to individuals and financed by government or by private insurance.

population not in the labor force
type: Class
subclass of: civilian non-institutional population
disjoint with: civilian labor force
definition: a subset of the civilian, noninstitutional population, that is considered neither employed nor unemployed by the reporting agency during the reporting period
adapted from: U.S. Bureau of Labor Statistics and Statistics Canada reference definitions - https://wiki.edmcouncil.org/pages/viewpage.action?pageId=6358041
explanatory note: There are a number of distinctions with respect to how individuals are counted from country to country, including whether or not they are considered employed if they are on unpaid leave for some reason, and whether or not they are counted multiple times if they have more than one paying job.

producer price index
type: Class
subclass of: Expression
subclass of: economic indicator
subclass of: Restriction
  on property: hasArgument
  some values from: fixed basket
subclass of: Restriction
  on property: hasArgument
  some values from: Class
    union of: enterprise population
    union of: establishment population
    union of: fixed basket population
subclass of: Restriction
  on property: appliesTo
  some values from: Class
    union of: enterprise population
    union of: establishment population
    union of: fixed basket population
disjoint with: consumer price index
definition: economic indicator representing a measure of the rate of change over time in the prices of goods and services bought and sold by producers
abbreviation: PPI
adapted from: https://www.imf.org/external/pubs/ft/ppi/2010/manual/ppi.pdf
explanatory note: Statistical agencies implement the Laspeyres index by putting it into price-relative (price change from the base period) and revenue-share (from the base period) format. In this form, the Laspeyres index can be written as the sum of base-period revenue shares of the items in the index times their corresponding price relatives. Statistical agency practice has introduced some approximations to the theoretical Laspeyres target due to a number of practical problems with producing the Laspeyres index exactly. For these and other pragmatic reasons, some agencies use alternatives depending on circumstances. See the IMF publication cited for a full explanation of the most commonly used approaches and trade-offs made for determining PPI.
explanatory note: The standard methodology for a typical PPI is based on a Laspeyres price index with fixed quantities from an earlier base period. The construction of this index can be thought of in terms of selecting a basket of goods and services representative of base-period revenues, valuing this at base-period prices, and then repricing the same basket at current-period prices. The target PPI in this case is defined to be the ratio of these two revenues. Practicing statisticians use this methodology because it has at least three practical advantages. It is easily explained to the public, it can use often expensive and untimely weighting information from the date of the last (or an even earlier) survey or administrative source (rather than requiring sources of data for the current month), and it need not be revised if users accept the Laspeyres premise.

productivity
type: Class
subclass of: Expression
subclass of: economic indicator
definition: economic indicator representing a ratio of a volume measure of output to a volume measure of input use
adapted from: http://stats.oecd.org/glossary/detail.asp
adapted from: http://www.oecd.org/std/productivity-stats/2352458.pdf
explanatory note: The primary objectives of productivity measurement include: (a) tracing technology change, i.e., the currently known ways of converting resources into outputs desired by the economy, (b) identifying changes in efficiency, (c) understanding real cost savings, (d) benchmarking production processes, and (e) assessing standards of living. Productivity measures may also be single factor or multifactor.

statistical information publisher
type: Class
subclass of: Publisher
subclass of: Restriction
  on property: hasIdentity
  some values from: FormalOrganization
definition: publisher that packages and makes analytical and statistical data available

ultimate consumer
type: Class
subclass of: Consumer
subclass of: Restriction
  on property: hasIdentity
  some values from: Person
definition: a person that is the ultimate user of a good, product or service
explanatory note: For the purposes of the CPI and related statistics, the definition of consumer is limited to humans. In general, a consumer could include a pet, as the consumer of pet food, for example, although the pet owner would likely be the purchaser and target of advertising.
explanatory note: The consumer is not always the purchaser of the product. Consumers are considered to be the users of the final product. For example, purchasers of building products are interim users of these products while constructing the finished product, which then may be purchased by the consumer.
synonym: consumer as defined by the Consumer Price Index (CPI)

underemployed population
type: Class
subclass of: employed population
definition: subset of the employed population that includes persons employed part-time for economic reasons, who want and are available for full-time work but have had to settle for a part-time schedule
adapted from: https://www.bls.gov/news.release/empsit.t15.htm

underemployed population with respect to occupation
type: Class
subclass of: underemployed population
definition: subset of the underemployed population that includes persons employed in a role that does not reflect their training and experience, excluding those that change careers

underutilized population
type: Class
subclass of: civilian non-institutional population
equivalent class: Class
  union of: underemployed population
  union of: unemployed population
  union of: marginally attached population
definition: subset of the civilian non-institutional population that includes persons employed part-time for economic reasons, persons that are marginally attached to the labor force, and persons that are identified as unemployed
adapted from: https://www.bls.gov/news.release/empsit.t15.htm

unemployed population
type: Class
subclass of: civilian labor force
subclass of: Restriction
  on property: has duration of unemployment
  some values from: Duration
disjoint with: employed population
definition: subset of the civilian labor force that is considered to have had no employment but was available for work, except for temporary illness, and had made specific efforts to find employment sometime during a specified period, during the reporting period
adapted from: U.S. Bureau of Labor Statistics and Statistics Canada reference definitions - https://wiki.edmcouncil.org/pages/viewpage.action?pageId=6358041
explanatory note: Persons who were waiting to be recalled to a job from which they had been laid off need not have been looking for work to be classified as unemployed.

unemployment rate
type: Class
subclass of: Expression
subclass of: economic indicator
subclass of: Restriction
  on property: hasArgument
  some values from: civilian labor force
subclass of: Restriction
  on property: hasArgument
  some values from: unemployed population
subclass of: Restriction
  on property: appliesTo
  some values from: unemployed population
definition: economic indicator representing the ratio of the unemployed population with respect to the civilian labor force of a given economy for some specified period
actual expression: unemployed population ÷ civilian labor force
adapted from: http://www.bls.gov/cps/faq.htm#Ques3
explanatory note: Persons are classified as unemployed if they do not have a job, have actively looked for work in the prior 4 weeks, and are currently available for work. Workers expecting to be recalled from layoff are counted as unemployed, whether or not they have engaged in a specific jobseeking activity. In all other cases, the individual must have been engaged in at least one active job search activity in the 4 weeks preceding the interview and be available for work (except for temporary illness).

value-added producer price index
type: Class
subclass of: producer price index
subclass of: Restriction
  on property: hasArgument
  some values from: input producer price index
subclass of: Restriction
  on property: hasArgument
  some values from: output producer price index
definition: economic indicator representing a weighted average of the input and output producer price indices
abbreviation: value-added PPI
adapted from: https://www.imf.org/external/pubs/ft/ppi/2010/manual/ppi.pdf

weekly
type: NamedIndividual
type: ExplicitRecurrenceInterval
definition: an explicit recurrence interval of one week, or 7 days
has duration value: P7D

excludes energy and food
type: DatatypeProperty
domain: consumer price index
range: boolean
definition: indicates whether the calculation of the index includes energy and food prices or not

has duration of unemployment
type: ObjectProperty
sub property of: hasDuration
range: Duration
definition: specifies the length of time, typically in weeks, that people classified as unemployed have been continuously looking for work
adapted from: definitions.htm

has indicator value
type: ObjectProperty
sub property of: hasQuantityValue
range: QuantityValue
definition: specifies a quantity value for a given indicator

has series origin
type: ObjectProperty
sub property of: hasStartDate
range: Date
definition: specifies the original starting date for the time series for a given economic indicator

is seasonally adjusted
type: DatatypeProperty
range: boolean
definition: a predicate indicating whether some published formal method is applied that compensates for seasonal variations in the population or index value
explanatory note: Example explanation from the US Bureau of Labor Statistics: Because price data are used for different purposes by different groups, the Bureau of Labor Statistics publishes seasonally adjusted as well as unadjusted changes each month. ... Seasonal factors used in computing the seasonally adjusted indexes are derived by the X-13ARIMA-SEATS Seasonal Adjustment Method. Seasonally adjusted indexes and seasonal factors are computed annually. Each year, the last five years of seasonally adjusted data are revised.