Raumgliederung - Stadtgebiet
type: Concept
in scheme: Musterdatenkatalog
preferred label: space planning - city area @en
definition: Informationen zu Stadtgebieten
related match: http://eurovoc.europa.eu/4809
related match: https://schema.org/City
broader: Raumplanung

Haushalt - Controlling
type: Concept
in scheme: Musterdatenkatalog
preferred label: budget - controlling @en
definition: Überwachung des kommunalen Haushalts
broad match: https://d-nb.info/gnd/4070102-5
related match: https://www.wikidata.org/wiki/Q2990807
broader: Finanzen

Wasserversorgung
type: Concept
in scheme: Musterdatenkatalog
preferred label: water supply @en
definition: Kennzahlen zur Wasserversorgung in einer Kommune
broader: Energie

Feuerwehr - Feuerwehreinsatz
type: Concept
in scheme: Musterdatenkatalog
preferred label: fire department - firefighting operation @en
definition: Daten zu Einsätzen der Feuerwehr in den Kommunen
related match: https://www.wikidata.org/wiki/Q897825
related match: http://eurovoc.europa.eu/1706
related match: https://schema.org/FireStation
broader: Sicherheit

Fläche - Grünfläche und Grünflächenkataster
type: Concept
in scheme: Musterdatenkatalog
preferred label: surface area - green space and green space register @en
definition: Verzeichnis der kommunalen Grünflächen meist mit Koppelung an ein Geoinformationssystem mit Angaben wie Fläche, Standort, Pflanzenbestand und Pflegemaßnahmen
broad match: https://d-nb.info/gnd/4029926-0
broad match: https://www.wikidata.org/wiki/Q191072
broad match: http://eurovoc.europa.eu/861
broader: Flora und Fauna

Wahl - Landtagswahl
type: Concept
in scheme: Musterdatenkatalog
preferred label: election - state election @en
definition: Wahleinrichtungen bzw. Wahlergebnisse der Landtagswahl
broad match: http://eurovoc.europa.eu/5607
broad match: https://schema.org/VoteAction
broader: Politische Partizipation

Raumgliederung - Postleitzahlengebiet
type: Concept
in scheme: Musterdatenkatalog
preferred label: space planning - postal code area @en
definition: Postleitzahlen von Städten und Gemeinden
narrow match: https://d-nb.info/gnd/4316292-7
broader: Raumplanung

Geförderter Wohnungsbau
type: Concept
in scheme: Musterdatenkatalog
preferred label: subsidized housing @en
definition: Kennzahlen zu öffentlich geförderten Wohnungen
narrow match: https://d-nb.info/gnd/4066778-9
related match: https://www.wikidata.org/wiki/Q12301128
related match: http://eurovoc.europa.eu/1695
broader: Soziale Hilfe

Raumgliederung - Ortsteil
type: Concept
in scheme: Musterdatenkatalog
preferred label: space planning - city district @en
definition: Daten zur kommunalen Gliederung in Stadtteile
broad match: http://eurovoc.europa.eu/4809
broader: Raumplanung

Staatsangehörigkeit
type: Concept
in scheme: Musterdatenkatalog
preferred label: citizenship @en
definition: Angaben zur Staatsangehörigkeit der Bevölkerung
broader: Bevölkerungsstruktur

Soziale Hilfe
type: Concept
in scheme: Musterdatenkatalog
top concept of: Musterdatenkatalog
narrower: Angebot und Beratungsstelle
narrower: Behinderung - Behindertenwohnheim
narrower: Behinderung - Menschen mit Behinderung
narrower: Bericht
narrower: Finanzielle Unterstützung - Förderung
narrower: Finanzielle Unterstützung - Grundsicherung
narrower: Finanzielle Unterstützung - Wohngeld
narrower: Flucht - Asylbewerber
narrower: Flucht - Flüchtlingsunterbringung
narrower: Flucht - Flüchtlingszahl
narrower: Flucht - Integration
narrower: Geförderter Wohnungsbau
narrower: Pflege
preferred label: social support @en
definition: Daten zu Hilfen von öffentlichen Stellen in sozialen Notlagen
related: http://publications.europa.eu/resource/authority/data-theme/SOCI

Fußverkehr - Gehweg
type: Concept
in scheme: Musterdatenkatalog
preferred label: pedestrian traffic - pavement @en
definition: Bürgersteige
broader: Verkehr

Dienstleistung - Handwerk
type: Concept
in scheme: Musterdatenkatalog
preferred label: service - craft and trade @en
definition: Gewerbliche Tätigkeiten, die dem Handwerk zugeordnet werden (nicht industriell)
broader: Wirtschaft

Verkehr
type: Concept
in scheme: Musterdatenkatalog
top concept of: Musterdatenkatalog
narrower: Ampelanlage
narrower: Flugverkehr - Flugbewegung
narrower: Flugverkehr - Flughafen
narrower: Fußverkehr - Fußgängerzone
narrower: Fußverkehr - Gehweg
narrower: Fußverkehr - Laufstrecke und Wanderstrecke
narrower: KFZ - Autobahn
narrower: KFZ - Bußgeld
narrower: KFZ - Carsharing
narrower: KFZ - Elektrotankstelle
narrower: KFZ - Fahrzeugzulassung
narrower: KFZ - Messung
narrower: KFZ - Parkplatz
narrower: KFZ - Tankstelle
narrower: KFZ - Taxistand
narrower: ÖPNV - Aufzug und Rolltreppe
narrower: ÖPNV - Fahrgastzahl
narrower: ÖPNV - Liniennetz Sollfahrdaten Echtzeitdaten
narrower: ÖPNV - Vertriebsstelle
narrower: Radverkehr - Abstellplatz
narrower: Radverkehr - Ladestation
narrower: Radverkehr - Messung
narrower: Radverkehr - Radweg und Radroute
narrower: Radverkehr - Verleih
narrower: Schiffsverkehr und Fährverkehr - Anlegestelle
narrower: Schiffsverkehr und Fährverkehr - Fracht
narrower: Schiffsverkehr und Fährverkehr - Passagier
narrower: Sondernutzung
narrower: Unfall
preferred label: transport @en
definition: Angaben zu Fortbewegungsarten und Verkehrsinfrastruktur
related match: https://schema.org/TravelAction
related: http://publications.europa.eu/resource/authority/data-theme/TRAN

Bibliothek - Besucherzahl
type: Concept
in scheme: Musterdatenkatalog
preferred label: library - attendance @en
definition: Anzahl der Besucherinnen und Besucher von Bibliotheken
broad match: https://d-nb.info/gnd/4006439-6
broad match: https://www.wikidata.org/wiki/Q7075
broad match: http://eurovoc.europa.eu/4865
broad match: https://schema.org/Library
editorial note: https://www.wikidata.org/wiki/Q659779 (attendance)
broader: Bildung

Volkshochschule - Veranstaltung
type: Concept
in scheme: Musterdatenkatalog
preferred label: adult education centre - events @en
definition: Events, die an Erwachsenenbildungsinstituten stattfinden
broad match: https://d-nb.info/gnd/4136151-9
broad match: http://eurovoc.europa.eu/5174
related match: https://schema.org/School
broader: Bildung

Baugenehmigung
type: Concept
in scheme: Musterdatenkatalog
preferred label: construction permit @en
definition: Bauaufsichtsbehördlich erteilte Genehmigung zur Errichtung, Änderung oder Beseitigung eines Baus
broader: Bau

Coworking
type: Concept
in scheme: Musterdatenkatalog
preferred label: coworking @en
definition: Gemeinsam genutzte bzw. geteilte Büroräumlichkeiten
broader: Wirtschaft

Beteiligung an Öffentlicher Wirtschaft - Ausschreibung und Vergabe
type: Concept
in scheme: Musterdatenkatalog
preferred label: participation in public economy - invitation to tender and public procurement @en
definition: Vergaben und Ausschreibungen
broader: Wirtschaft

Hochschule - Studentenwohnheim
type: Concept
in scheme: Musterdatenkatalog
preferred label: university - student residence @en
definition: Unterkünfte für Studierende
broad match: https://schema.org/CollegeOrUniversity
editorial note: https://www.wikidata.org/wiki/Q30301498 (student housing, no German)
broader: Bildung

KFZ - Messung
type: Concept
in scheme: Musterdatenkatalog
preferred label: motor vehicle - traffic count @en
definition: KFZ-Zählung und Geschwindigkeitsüberwachung
broad match: https://schema.org/Vehicle
broader: Verkehr

Baumbestand - Baumkataster
type: Concept
in scheme: Musterdatenkatalog
preferred label: tree population - tree register @en
definition: Verzeichnis, in dem Bäume inklusive Standort und weiteren Informationen verwaltet werden
broad match: https://www.wikidata.org/wiki/Q110543721
broad match: https://schema.org/Registry
related match: http://eurovoc.europa.eu/2404
broader: Flora und Fauna

Bibliothek - Bestand
type: Concept
in scheme: Musterdatenkatalog
preferred label: library - collection @en
definition: Gesamtheit der in Bibliotheken gesammelten Publikationen
broad match: http://eurovoc.europa.eu/4865
broad match: https://schema.org/Library
editorial note: https://schema.org/collectionSize
broader: Bildung

Bauleitplan
type: Concept
in scheme: Musterdatenkatalog
preferred label: urban land-use plan @en
definition: Daten zu städtebaulichen Entwicklungsplänen
broad match: https://www.wikidata.org/wiki/Q457109
broad match: https://schema.org/PlanAction
related match: http://eurovoc.europa.eu/2391
broader: Raumplanung

Raumgliederung - Block
type: Concept
in scheme: Musterdatenkatalog
preferred label: space planning - city block @en
definition: Beschreibung von Gebieten innerhalb eines Stadtteils, die als Blöcke bezeichnet werden
broad match: http://eurovoc.europa.eu/4809
broader: Raumplanung

Hundekottüte
type: Concept
in scheme: Musterdatenkatalog
preferred label: dog waste bag @en
definition: Standorte von Hundekotbeutelstationen
broad match: https://d-nb.info/gnd/4701957-8
related match: http://eurovoc.europa.eu/1919
editorial note: https://www.wikidata.org/wiki/Q1323314 (Beutel), https://d-nb.info/gnd/4497235-0 (Tüte), https://d-nb.info/gnd/4113972-0 (Hundehaltung)
broader: Bürgerservice

Steuern und Abgaben
type: Concept
in scheme: Musterdatenkatalog
preferred label: taxes and charges @en
definition: Aufkommen an Steuern, Beiträgen und Gebühren
narrow match: https://d-nb.info/gnd/4057399-0
narrow match: http://eurovoc.europa.eu/1310
broad match: https://www.wikidata.org/wiki/Q8161
broader: Finanzen

Bürgerservice
type: Concept
in scheme: Musterdatenkatalog
top concept of: Musterdatenkatalog
narrower: Anliegenmanagement
narrower: Dienstleistung
narrower: Hundekottüte
narrower: Telefonverzeichnis
narrower: Termin
narrower: Wartezeit
preferred label: citizen service @en
definition: Zentrale Anlaufstelle, die Bürgerinnen und Bürgern Informationen und die Erledigung ihrer Anliegen aus erster Hand anbietet
related match: https://schema.org/serviceLocation
related: http://publications.europa.eu/resource/authority/data-theme/GOVE

Unterkunft - Privatunterkunft
type: Concept
in scheme: Musterdatenkatalog
preferred label: accommodation - private accommodation @en
definition: Privatunterkünfte und Übernachtungsmöglichkeiten
related match: http://eurovoc.europa.eu/1690
related match: https://schema.org/LodgingBusiness
broader: Tourismus

Radverkehr - Verleih
type: Concept
in scheme: Musterdatenkatalog
preferred label: bicycle traffic - rental @en
definition: Standorte der Fahrradmietsysteme
broad match: http://eurovoc.europa.eu/3097
broad match: https://schema.org/RentAction
broader: Verkehr

Urban Gardening
type: Concept
in scheme: Musterdatenkatalog
preferred label: urban gardening @en
definition: Kleinräumige, gärtnerisch genutzte städtische Flächen
broad match: https://www.wikidata.org/wiki/Q465429
broad match: http://eurovoc.europa.eu/1260
broader: Flora und Fauna

Gesundheit
type: Concept
in scheme: Musterdatenkatalog
top concept of: Musterdatenkatalog
narrower: Apotheke
narrower: Arzt
narrower: Gesundheitsberichterstattung
narrower: Hebamme
narrower: Infektion
narrower: Krankenhaus
narrower: Öffentliche Toilette
narrower: Rettungsdienst - Defibrillator
narrower: Rettungsdienst - Rettungsdiensteinsatz
preferred label: health @en
definition: Daten zu kommunalen Gesundheitsdienstleistungen und -einrichtungen
narrow match: http://eurovoc.europa.eu/3885
narrow match: https://schema.org/CommunityHealth
related: http://publications.europa.eu/resource/authority/data-theme/HEAL

Rettungsdienst - Defibrillator
type: Concept
in scheme: Musterdatenkatalog
preferred label: emergency service - defibrillator @en
definition: Standorte kommunaler Defibrillatoren
broad match: http://eurovoc.europa.eu/3844
broad match: https://schema.org/MedicalDevice
broader: Gesundheit

WLAN und Mobilfunk
type: Concept
in scheme: Musterdatenkatalog
preferred label: wifi and mobile telephony @en
definition: Standorte von WLAN-Hotspots, Freifunkrouter und Mobilfunkstandorte
broad match: https://d-nb.info/gnd/4633975-9
broad match: https://www.wikidata.org/wiki/Q212607
broad match: http://eurovoc.europa.eu/c_12e208c8
broad match: https://schema.org/telephone
broader: Digitalisierung

Geschichte
type: Concept
in scheme: Musterdatenkatalog
top concept of: Musterdatenkatalog
narrower: Quelle - Archivbestand
narrower: Quelle - Entschädigung
narrower: Quelle - Historische Karte
narrower: Quelle - Historische Luftaufnahme
narrower: Quelle - Personalverzeichnis
narrower: Standort mit Geschichte
preferred label: history @en
definition: Daten zum politischen, kulturellen und gesellschaftlichen Werdegang, Entwicklungsprozess einer Kommune
narrow match: http://eurovoc.europa.eu/1245
related: http://publications.europa.eu/resource/authority/data-theme/SOCI

Öffentliche Toilette
type: Concept
in scheme: Musterdatenkatalog
preferred label: public toilet @en
definition: Informationen zu Standort und Austattung der öffentlichen Bedürfnisanstalten in einer Kommune
broad match: http://eurovoc.europa.eu/3377
editorial note: https://d-nb.info/gnd/4051579-5 (Sanitäranlage)
broader: Gesundheit

Insolvenz
type: Concept
in scheme: Musterdatenkatalog
preferred label: insolvency @en
definition: Unternehmensinsolvenzen
broader: Wirtschaft

Stellenplan
type: Concept
in scheme: Musterdatenkatalog
preferred label: staffing plan @en
definition: Plan der Stellen im städtischen Dienst
related match: http://eurovoc.europa.eu/2126
related match: https://schema.org/JobPosting
broader: Städtisches Personal

Entwässerung
type: Concept
in scheme: Musterdatenkatalog
preferred label: drainage @en
definition: Statistiken zum Abführen von [Ab]wasser durch künstliche und natürliche Einrichtungen
broader: Abfallentsorgung

Stellenausschreibung
type: Concept
in scheme: Musterdatenkatalog
preferred label: job posting @en
definition: Städtische Stellenangebote
related match: http://eurovoc.europa.eu/2126
broader: Städtisches Personal

Wärmeversorgung
type: Concept
in scheme: Musterdatenkatalog
preferred label: heat supply @en
definition: Kennzahlen zur Wärmeversorgung in einer Kommune
narrow match: https://www.wikidata.org/wiki/Q29584660
narrow match: https://schema.org/HVACBusiness
related match: http://eurovoc.europa.eu/5503
broader: Energie

ÖPNV - Liniennetz Sollfahrdaten Echtzeitdaten
type: Concept
in scheme: Musterdatenkatalog
preferred label: public transportation - route network target timetable actual timetable @en
definition: Netz der kommunalen Verkehrslinien bzw. Ist- und Sollfahrdaten
related match: http://eurovoc.europa.eu/4512
related match: https://schema.org/TransitMap
broader: Verkehr

Flugverkehr - Flughafen
type: Concept
in scheme: Musterdatenkatalog
preferred label: air traffic - airport @en
definition: Standorte und weitere Informationen zu Flughäfen
broader: Verkehr

Quelle - Historische Luftaufnahme
type: Concept
in scheme: Musterdatenkatalog
preferred label: source - historical aerial view @en
definition: Daten zu historischen Fotoaufnahmen der Kommunen aus der Luft
broad match: https://d-nb.info/gnd/4036546-3
broad match: https://www.wikidata.org/wiki/Q113670888
broad match: http://eurovoc.europa.eu/c_cdec6719
broad match: https://schema.org/Photograph
broader: Geschichte

Politische Vertretung - Bürgermeister
type: Concept
in scheme: Musterdatenkatalog
preferred label: political representation - mayor @en
definition: Angaben zu den Bürgermeisterinnen und Bürgermeistern der Kommunen
broad match: http://eurovoc.europa.eu/5118
broad match: https://schema.org/Person
broader: Politische Partizipation

Haushalt - Zuwendung und Förderung
type: Concept
in scheme: Musterdatenkatalog
preferred label: budget - grant @en
definition: Finanzielle Zuwendungen aus dem kommunalen Budget
narrow match: https://d-nb.info/gnd/4154943-0
related match: http://eurovoc.europa.eu/922
related match: https://schema.org/Grant
broader: Finanzen

Energiebericht
type: Concept
in scheme: Musterdatenkatalog
preferred label: energy report @en
definition: Darstellungen im Bereich Energiemanagement und der Erfolge von durchgeführten Maßnahmen
broad match: https://d-nb.info/gnd/4014692-3
broad match: https://www.wikidata.org/wiki/Q11379
broad match: http://eurovoc.europa.eu/100159
broad match: https://schema.org/Energy
broader: Energie

Wahl - Wahllokal
type: Concept
in scheme: Musterdatenkatalog
preferred label: election - polling place @en
definition: Daten zu Orten der Wahlaustragung
broad match: https://schema.org/areaServed
broader: Politische Partizipation

Behinderung - Menschen mit Behinderung
type: Concept
in scheme: Musterdatenkatalog
preferred label: disability - people with disabilities @en
definition: Informationen zu Menschen mit Behinderung
broader: Soziale Hilfe

Fußverkehr - Fußgängerzone
type: Concept
in scheme: Musterdatenkatalog
preferred label: pedestrian traffic - pedestrian zone @en
definition: Verkehrsflächen, auf denen Fußgängerinnen und Fußgänger Vorrang oder ausschließliches Nutzungsrecht gegenüber anderen Verkehrsteilnehmerinnen und Verkehrsteilnehmern haben
broader: Verkehr

Apotheke
type: Concept
in scheme: Musterdatenkatalog
preferred label: pharmacy @en
definition: Standorte und weitere Angaben zu Apotheken
broader: Gesundheit

Schule - Standort
type: Concept
in scheme: Musterdatenkatalog
preferred label: school - location @en
definition: Standorte, an denen sich Schulen befinden
broad match: https://d-nb.info/gnd/4053474-1
broad match: https://www.wikidata.org/wiki/Q3914
broad match: https://schema.org/School
related match: http://eurovoc.europa.eu/1307
broader: Bildung

Bad und Freibad
type: Concept
in scheme: Musterdatenkatalog
preferred label: public pool @en
definition: Standorte und Kennzahlen der kommunalen Schwimmbäder
narrow match: https://www.wikidata.org/wiki/Q1757063
narrow match: https://schema.org/PublicSwimmingPool
broad match: http://eurovoc.europa.eu/847
broader: Freizeit

Spielplatz und Spielstätte
type: Concept
in scheme: Musterdatenkatalog
preferred label: playground and event venue @en
definition: Standorte bzw. Kennzahlen der kommunalen Spielanlagen
narrow match: https://d-nb.info/gnd/4056237-2
narrow match: https://www.wikidata.org/wiki/Q11875349
narrow match: https://schema.org/Playground
broader: Freizeit

Krankenhaus
type: Concept
in scheme: Musterdatenkatalog
preferred label: hospital @en
definition: Standorte und Kennzahlen zu Krankenhäusern in einer Kommune
editorial note: https://d-nb.info/gnd/4025913-4 (Hospital), https://www.wikidata.org/wiki/Q1774898 (Klinik)
broader: Gesundheit

Museum - Standort
type: Concept
in scheme: Musterdatenkatalog
preferred label: museum - location @en
definition: Standorte der Museen in Kommunen
broad match: https://d-nb.info/gnd/4040795-0
broad match: https://www.wikidata.org/wiki/Q33506
broad match: http://eurovoc.europa.eu/2022
broad match: https://schema.org/location
broader: Kultur

Infektion
type: Concept
in scheme: Musterdatenkatalog
preferred label: infection @en
definition: Infektionsgeschehen in den Kommunen
narrow match: http://eurovoc.europa.eu/c_9b88f778
related match: https://schema.org/InfectiousDisease
broader: Gesundheit

Friedhof - Grabstätte
type: Concept
in scheme: Musterdatenkatalog
preferred label: cemetery - place of burial @en
definition: Standorte und Eigenschaften von Stellen, an denen Tote beerdigt sind
broad match: http://eurovoc.europa.eu/5488
broad match: https://schema.org/Cemetery
broader: Kultur

Bürofläche Industriefläche Gewerbefläche
type: Concept
in scheme: Musterdatenkatalog
preferred label: office space industrial space commercial space @en
definition: Gewerblich genutzte Flächen
editorial note: https://d-nb.info/gnd/7766022-5 (Bürofläche)
broader: Wirtschaft

Flugverkehr - Flugbewegung
type: Concept
in scheme: Musterdatenkatalog
preferred label: air traffic - aircraft movement @en
definition: Flugbewegungen und Fluggastaufkommen
broad match: https://d-nb.info/gnd/4036597-9
broad match: http://eurovoc.europa.eu/2039
related match: https://schema.org/aircraft
broader: Verkehr

Dienstleistung - Wochenmarkt
type: Concept
in scheme: Musterdatenkatalog
preferred label: service - farmer's market @en
definition: Regelmäßig stattfindende Märkte, besonders für Gemüse, Obst, Fleisch, Blumen
editorial note: https://d-nb.info/gnd/4017578-9 (Flohmarkt), https://www.wikidata.org/wiki/Q385870 (Flohmarkt), https://www.wikidata.org/wiki/Q57330418 (Gebrauchtmarkt)
broader: Wirtschaft

Vorname
type: Concept
in scheme: Musterdatenkatalog
preferred label: first name @en
definition: Statistiken zu vergebenen Vornamen
related match: http://eurovoc.europa.eu/3315
broader: Bevölkerungsstruktur

Rettungshilfe - Anlaufstelle
type: Concept
in scheme: Musterdatenkatalog
preferred label: rescue service - contact point @en
definition: Kontaktstellen der Institutionen, Organisationen oder Personen, an die man sich im Notfall wenden kann, um Hilfe oder Unterstützung zu bekommen (z. B. bei Feuer, Lebensgefahr, medizinischer Notlage)
related match: https://d-nb.info/gnd/4032261-0
broad match: http://eurovoc.europa.eu/c_f7430876
broad match: https://schema.org/ContactPoint
broader: Sicherheit

Wartezeit
type: Concept
in scheme: Musterdatenkatalog
preferred label: waiting time @en
definition: Wartezeiten in Einrichtungen der Kommunalverwaltung
related match: https://www.wikidata.org/wiki/Q11471
broader: Bürgerservice

Bibliothek - Standort
type: Concept
in scheme: Musterdatenkatalog
preferred label: library - location @en
definition: Standorte von Bibliotheken
broad match: https://d-nb.info/gnd/4006439-6
broad match: https://www.wikidata.org/wiki/Q7075
broad match: https://schema.org/Library
related match: http://eurovoc.europa.eu/4865
editorial note: https://d-nb.info/gnd/4120801-8 (Niederlassung)
broader: Bildung

Justizeinrichtung
type: Concept
in scheme: Musterdatenkatalog
preferred label: judicial organisation @en
definition: Angaben über kommunale Justizstandorte
broad match: https://d-nb.info/gnd/4073136-4
narrow match: https://www.wikidata.org/wiki/Q41487
narrow match: http://eurovoc.europa.eu/877
editorial note: https://d-nb.info/gnd/4162941-3 (Justizbehörde)
broader: Justiz

Denkmal
type: Concept
in scheme: Musterdatenkatalog
preferred label: monument @en
definition: Standorte und weitere Angaben zu Denkmälerm bzw. Erinnerungsorten in Kommunen
related match: https://schema.org/LandmarksOrHistoricalBuildings
broader: Kultur

Dienstleistung - Einzelhandel
type: Concept
in scheme: Musterdatenkatalog
preferred label: service - retail @en
definition: Einzelhandelsgeschäft
broader: Wirtschaft

Musikschule - Teilnehmerzahl
type: Concept
in scheme: Musterdatenkatalog
preferred label: music school - number of participants @en
definition: Zahl der Personen, die an Unterricht oder Veranstaltungen der Musikschulen teilnehmen
broad match: https://d-nb.info/gnd/4170834-9
broad match: https://www.wikidata.org/wiki/Q1021290
broad match: https://schema.org/School
related match: http://eurovoc.europa.eu/1098
editorial note: https://d-nb.info/gnd/4117181-0 (Teilnehmer), https://d-nb.info/gnd/4560364-9 (Teilnehmerin), https://www.wikidata.org/wiki/Q59262000 (Schulbesuch), https://www.wikidata.org/wiki/Q659779 (attendance, no German), https://www.wikidata.org/wiki/Q1021290 (Musikschule), https://www.wikidata.org/wiki/Q211198 (Publikum)
broader: Bildung

Fläche - Ausgleichsfläche
type: Concept
in scheme: Musterdatenkatalog
preferred label: surface area - compensation area @en
definition: Flächen für den Naturschutz, die bei Eingriffen in Natur und Landschaft, wie z. B. größere Bauprojekte, dafür sorgen, dass ein gewisser Ausgleich für negative ökologische Folgen geschaffen wird
related match: https://www.wikidata.org/wiki/Q108063179
broader: Flora und Fauna

Feuerwehr - Personal
type: Concept
in scheme: Musterdatenkatalog
preferred label: fire department - staff @en
definition: Daten zu den im Feuerwehrdienst tätigen Einsatzkräften
broad match: https://d-nb.info/gnd/4239371-1
broad match: https://www.wikidata.org/wiki/Q105764136
broad match: http://eurovoc.europa.eu/1706
broad match: https://schema.org/employee
editorial note: https://d-nb.info/gnd/7521348-5 (Feuerwehrfrau)
broader: Sicherheit

Politische Partizipation
type: Concept
in scheme: Musterdatenkatalog
top concept of: Musterdatenkatalog
narrower: Bürgerbeteiligung - Bürgerentscheid
narrower: Bürgerbeteiligung - Bürgerhaushalt
narrower: Bürgerbeteiligung - Entwicklung und Information
narrower: Bürgerbeteiligung - Umfrage
narrower: Politische Vertretung - Bürgermeister
narrower: Politische Vertretung - Gremium
narrower: Politische Vertretung - Mandatsträger
narrower: Verband
narrower: Wahl - Beiratswahl
narrower: Wahl - Bundestagswahl
narrower: Wahl - Europawahl
narrower: Wahl - Kandidatenliste
narrower: Wahl - Kommunalwahl
narrower: Wahl - Landtagswahl
narrower: Wahl - Straßenverzeichnis
narrower: Wahl - Verbundwahl
narrower: Wahl - Wahlkreis und Wahlbezirk
narrower: Wahl - Wahllokal
preferred label: political participation @en
definition: Teilhabe und Beteiligung von Bürgerinnen und Bürgern an politischen Willensbildungs- und Entscheidungsprozessen
related: http://publications.europa.eu/resource/authority/data-theme/GOVE

Pflege
type: Concept
in scheme: Musterdatenkatalog
preferred label: nursing care @en
definition: Informationen zu Pflegepersonal und Pflegeeinrichtungen
narrow match: http://eurovoc.europa.eu/5900
broader: Soziale Hilfe

Schule - Internetanbindung
type: Concept
in scheme: Musterdatenkatalog
preferred label: school - internet connection @en
definition: Anbindung von Schulen ins Internet
broad match: https://d-nb.info/gnd/4053474-1
broad match: https://schema.org/School
related match: https://www.wikidata.org/wiki/Q3914
editorial note: https://d-nb.info/gnd/4191103-9 (Zugang), http://data.europa.eu/8mn/euroscivoc/bd465a67-08a6-4341-b833-aee6c5545f95 (Internetzugang)
broader: Bildung

Veranstaltung - Angebot
type: Concept
in scheme: Musterdatenkatalog
preferred label: event - offer @en
definition: Informationen zu angebotenen Veranstaltungen
broad match: https://d-nb.info/gnd/4125453-3
broad match: https://www.wikidata.org/wiki/Q1656682
narrow match: http://eurovoc.europa.eu/1780
related match: https://schema.org/eventSchedule
broader: Kultur

Theater - Besucherzahl
type: Concept
in scheme: Musterdatenkatalog
preferred label: theatre - attendance @en
definition: Anzahl der Besucherinnen und Besucher von Theatern
broad match: https://d-nb.info/gnd/4059702-7
narrow match: https://www.wikidata.org/wiki/Q659779
related match: http://eurovoc.europa.eu/2810
related match: https://schema.org/TheaterEvent
broader: Kultur

Dienstleistung
type: Concept
in scheme: Musterdatenkatalog
preferred label: service @en
definition: Serviceangebote der Bürgerservicestellen
related match: https://d-nb.info/gnd/4164786-5
related match: https://schema.org/Service
broad match: https://www.wikidata.org/wiki/Q6936366
broad match: http://eurovoc.europa.eu/6369
broader: Bürgerservice

Rettungshilfe - Notinsel
type: Concept
in scheme: Musterdatenkatalog
preferred label: rescue service - Notinsel (safe haven for children in need) @en
definition: Standorte von Anlaufpunkten, die Kindern in Not im Rahmen des Projekts 'Notinsel' als Zuflucht dienen
broad match: https://d-nb.info/gnd/4256177-2
broad match: http://eurovoc.europa.eu/3919
broader: Sicherheit

Musikschule - Unterrichtsangebot
type: Concept
in scheme: Musterdatenkatalog
preferred label: music school - classes offered @en
definition: Fächer, die an Musikschulen unterricht werden
broad match: https://d-nb.info/gnd/4170834-9
broad match: https://www.wikidata.org/wiki/Q1021290
broad match: http://eurovoc.europa.eu/2794
broad match: https://schema.org/School
editorial note: https://www.wikidata.org/wiki/Q1402601 (Lehrplan)
broader: Bildung

Sicherheit
type: Concept
in scheme: Musterdatenkatalog
top concept of: Musterdatenkatalog
narrower: Beleuchtung
narrower: Feuerwehr - Feuerwehreinsatz
narrower: Feuerwehr - Personal
narrower: Feuerwehr - Standort
narrower: Kriminalitätsstatistik
narrower: Ordnungsamt
narrower: Polizei
narrower: Rettungshilfe - Anlaufstelle
narrower: Rettungshilfe - Notfallnummer
narrower: Rettungshilfe - Notinsel
narrower: Rettungshilfe - Waldrettungspunkt
narrower: Zivilschutz und Katastrophenschutz - Kampfmittelfund
narrower: Zivilschutz und Katastrophenschutz - Sirene
preferred label: safety and security @en
definition: Daten zu kommunalen Sicherheitsthemen
related: http://publications.europa.eu/resource/authority/data-theme/JUST

Abfallkalender
type: Concept
in scheme: Musterdatenkatalog
preferred label: waste calendar @en
definition: Auflistung der Müllabfuhrtermine nach Abfallkategorie und Ort
broad match: https://d-nb.info/gnd/4029290-3
broad match: https://www.wikidata.org/wiki/Q12132
broad match: https://schema.org/Schedule
editorial note: https://d-nb.info/gnd/4184755-6 (Termin), https://d-nb.info/gnd/4184761-1 (Terminvereinbarung)
broader: Abfallentsorgung

Stadtplan
type: Concept
in scheme: Musterdatenkatalog
preferred label: city map @en
definition: Kartographische Daten einer Stadt
related match: http://eurovoc.europa.eu/3930
broad match: https://schema.org/Map
broader: Raumplanung

Freizeit
type: Concept
in scheme: Musterdatenkatalog
top concept of: Musterdatenkatalog
narrower: Bad und Freibad
narrower: Ferienangebot
narrower: Grillplatz
narrower: Jugendeinrichtung
narrower: Sitzgelegenheit
narrower: Spielplatz und Spielstätte
narrower: Verein
preferred label: leisure @en
definition: kommunale Freizeitangebote
related: http://publications.europa.eu/resource/authority/data-theme/EDUC

Haushalt - Plan
type: Concept
in scheme: Musterdatenkatalog
preferred label: budget - municipal budget plan @en
definition: Kommunale Haushaltspläne
broader: Finanzen

Veranstaltung - Besucherzahl
type: Concept
in scheme: Musterdatenkatalog
preferred label: event - attendance @en
definition: Anzahl der Besucherinnen und Besucher einer Veranstaltung
broad match: https://d-nb.info/gnd/4125453-3
narrow match: http://eurovoc.europa.eu/1780
related match: https://schema.org/eventSchedule
broader: Kultur

Raumgliederung - Straße
type: Concept
in scheme: Musterdatenkatalog
preferred label: space planning - street @en
definition: Informationen zu Straßen
narrow match: http://eurovoc.europa.eu/4740
broader: Raumplanung

Bildung
type: Concept
in scheme: Musterdatenkatalog
top concept of: Musterdatenkatalog
narrower: Ausbildung
narrower: Bibliothek - Ausleihe
narrower: Bibliothek - Bestand
narrower: Bibliothek - Besucherzahl
narrower: Bibliothek - Budget
narrower: Bibliothek - Standort
narrower: Hochschule - Standort
narrower: Hochschule - Studentenwohnheim
narrower: Hochschule - Studierendenzahl
narrower: Kindertageseinrichtung - Betreuungsplatz
narrower: Kindertageseinrichtung - Standort
narrower: Musikschule - Teilnehmerzahl
narrower: Musikschule - Unterrichtsangebot
narrower: Schule - Internetanbindung
narrower: Schule - Schulangebot
narrower: Schule - Schuleingangsuntersuchung
narrower: Schule - Schulentwicklungsplan
narrower: Schule - Schülerzahl
narrower: Schule - Standort
narrower: Schule - Wunschschule
narrower: Volkshochschule - Teilnehmerzahl
narrower: Volkshochschule - Veranstaltung
preferred label: education @en
definition: Vermittlung von Fertigkeiten und Wissen durch eine dazu befugte Einrichtung, beispielsweise eine staatliche Schule, eine Hochschule oder ein privates Unternehmen
related: http://publications.europa.eu/resource/authority/data-theme/EDUC

Tourismus
type: Concept
in scheme: Musterdatenkatalog
top concept of: Musterdatenkatalog
narrower: Gästezahl
narrower: Sehenswürdigkeit
narrower: Stadtführung
narrower: Unterkunft - Campingplatz
narrower: Unterkunft - Herberge
narrower: Unterkunft - Hotel
narrower: Unterkunft - Privatunterkunft
preferred label: tourism @en
definition: Informationen zum Städtetourismus
related: http://publications.europa.eu/resource/authority/data-theme/ECON

Schiffsverkehr und Fährverkehr - Anlegestelle
type: Concept
in scheme: Musterdatenkatalog
preferred label: boat traffic and ferry traffic - jetty @en
definition: Standorte der Schiffsanlegestellen und deren Belegung
broad match: http://eurovoc.europa.eu/4827
related match: https://schema.org/BoatTrip
broader: Verkehr

Arbeitslosigkeit
type: Concept
in scheme: Musterdatenkatalog
preferred label: unemployment @en
definition: Statistische Daten zu Arbeitslosigkeit
broader: Wirtschaft

Wahl - Beiratswahl
type: Concept
in scheme: Musterdatenkatalog
preferred label: election - advisory board election @en
definition: Informationen über die Wahlen kommunaler Beiräte
broad match: https://d-nb.info/gnd/4005347-7
broad match: https://www.wikidata.org/wiki/Q4686866
broad match: http://eurovoc.europa.eu/695
broad match: https://schema.org/VoteAction
broader: Politische Partizipation

Kriminalitätsstatistik
type: Concept
in scheme: Musterdatenkatalog
preferred label: crime statistics @en
definition: Daten zur Kriminalität
broad match: http://eurovoc.europa.eu/4256
broader: Sicherheit

Migrationshintergrund
type: Concept
in scheme: Musterdatenkatalog
preferred label: migration background @en
definition: Daten zur Bevölkerungszusammensetzung im Hinblick auf den Faktor 'Migrationshintergrund'
editorial note: http://eurovoc.europa.eu/1909 (Wanderung), http://eurovoc.europa.eu/100209 (Wanderungsbewegungen)
broader: Bevölkerungsstruktur

Schule - Wunschschule
type: Concept
in scheme: Musterdatenkatalog
preferred label: school - school of choice @en
definition: Angaben zur Wahl der Erstwunsch-Schule
broad match: https://d-nb.info/gnd/4053474-1
broad match: https://www.wikidata.org/wiki/Q3914
broad match: https://schema.org/School
broader: Bildung

Theater - Programm
type: Concept
in scheme: Musterdatenkatalog
preferred label: theatre - programme @en
definition: Informationen zu Theatervorstellungen
related match: http://eurovoc.europa.eu/2810
related match: https://schema.org/TheaterEvent
broader: Kultur

Bericht und Analyse - Klimabilanz
type: Concept
in scheme: Musterdatenkatalog
preferred label: report and analysis - climate footprint @en
definition: Kennzahlen zur Klimabilanz der Kommunen
broad match: https://d-nb.info/gnd/4202417-1
broad match: https://schema.org/Report
narrow match: https://www.wikidata.org/wiki/Q310667
narrow match: http://eurovoc.europa.eu/c_82916123
editorial note: https://d-nb.info/gnd/4429612-5 (Global Climate Observing System), https://d-nb.info/gnd/7547705-1 (Klimaschutz). http://eurovoc.europa.eu/6011 (Klima)
broader: Klimaschutz und Umweltschutz

Schiffsverkehr und Fährverkehr - Fracht
type: Concept
in scheme: Musterdatenkatalog
preferred label: boat traffic and ferry traffic - cargo @en
definition: Güterumschlag
related match: https://d-nb.info/gnd/4018026-8
related match: https://schema.org/cargoVolume
editorial note: Verkehrszählung
broader: Verkehr

Baufertigstellung
type: Concept
in scheme: Musterdatenkatalog
preferred label: construction completion @en
definition: Bauvorhaben, deren Bauarbeiten weitgehend abgeschlossen sind
related match: https://d-nb.info/gnd/4194623-6
related match: http://eurovoc.europa.eu/3376
related match: https://schema.org/HomeAndConstructionBusiness
editorial note: NACE: https://op.europa.eu/en/web/eu-vocabularies/concept/-/resource?uri=http://data.europa.eu/ux2/nace2/F
broader: Bau

Hebamme
type: Concept
in scheme: Musterdatenkatalog
preferred label: midwife @en
definition: Listen aller im Kommunalgebiet tätigen Hebammen
broad match: https://schema.org/Midwifery
broader: Gesundheit

KFZ - Autobahn
type: Concept
in scheme: Musterdatenkatalog
preferred label: motor vehicle - motorway @en
definition: Informationen zum Autobahn-Straßennetz
related match: https://schema.org/Car
broader: Verkehr

Bevölkerungsstruktur
type: Concept
in scheme: Musterdatenkatalog
top concept of: Musterdatenkatalog
narrower: Demografiebericht
narrower: Einwohnerzahl
narrower: Haushaltszusammensetzung
narrower: Migrationshintergrund
narrower: Religionszugehörigkeit
narrower: Staatsangehörigkeit
narrower: Vorname
preferred label: population structure @en
definition: Zusammensetzung einer Bevölkerung nach bestimmten Merkmalen, die deren Charakteristika beschreiben
related: http://publications.europa.eu/resource/authority/data-theme/SOCI

Abfallmenge
type: Concept
in scheme: Musterdatenkatalog
preferred label: waste volume @en
definition: Menge des entsorgten Mülls nach unterschiedlichen Abfallarten
broad match: https://d-nb.info/gnd/4245395-1
broad match: https://schema.org/Quantity
narrow match: https://www.wikidata.org/wiki/Q319938
broader: Abfallentsorgung

Windenergie
type: Concept
in scheme: Musterdatenkatalog
preferred label: wind power @en
definition: Kennzahlen zur Versorgung mit Windenergie in einer Kommune
narrow match: https://schema.org/Energy
broader: Energie

Bürgerbeteiligung - Umfrage
type: Concept
in scheme: Musterdatenkatalog
preferred label: public participation - survey @en
definition: Daten zu Befragungen von Bürgerinnen und Bürgern zu bestimmten Themen der Verwaltung
broad match: https://d-nb.info/gnd/4005227-8
broad match: http://eurovoc.europa.eu/4214
broad match: https://schema.org/VoteAction
broader: Politische Partizipation

KFZ - Bußgeld
type: Concept
in scheme: Musterdatenkatalog
preferred label: motor vehicle - traffic fine @en
definition: Bußgelddaten
broad match: https://d-nb.info/gnd/4009218-5
broad match: http://eurovoc.europa.eu/1549
related match: https://schema.org/MonetaryAmount
broader: Verkehr

KFZ - Parkplatz
type: Concept
in scheme: Musterdatenkatalog
preferred label: motor vehicle - parking lot @en
definition: Parkberechtigungen, Parkhäuser, Parkflächen
broader: Verkehr

Wirtschaft
type: Concept
in scheme: Musterdatenkatalog
top concept of: Musterdatenkatalog
narrower: Arbeitslosigkeit
narrower: Berufspendler
narrower: Beschäftigung
narrower: Beteiligung an Öffentlicher Wirtschaft - Ausschreibung und Vergabe
narrower: Beteiligung an Öffentlicher Wirtschaft - Beteiligung
narrower: Bürofläche Industriefläche Gewerbefläche
narrower: Coworking
narrower: Dienstleistung - Einzelhandel
narrower: Dienstleistung - Handwerk
narrower: Dienstleistung - Postfiliale
narrower: Dienstleistung - Weihnachtsmarkt
narrower: Dienstleistung - Wochenmarkt
narrower: Gewerbeanmeldung
narrower: Insolvenz
narrower: Wirtschaftsförderung
narrower: Wirtschaftsstandort
preferred label: economy @en
definition: Wirtschaftsdaten
related: http://publications.europa.eu/resource/authority/data-theme/ECON

Hochschule - Studierendenzahl
type: Concept
in scheme: Musterdatenkatalog
preferred label: university - number of students @en
definition: Anzahl der Studierenden an einer Hochschule
related match: http://eurovoc.europa.eu/684
broad match: https://schema.org/CollegeOrUniversity
broader: Bildung

Sondernutzung
type: Concept
in scheme: Musterdatenkatalog
preferred label: special use @en
definition: Anträge auf Ausnahmegenehmigungen und Erlaubnisse im Straßenverkehr
broader: Verkehr

Berufspendler
type: Concept
in scheme: Musterdatenkatalog
preferred label: working commuter @en
definition: Infomationen zu Pendlerinnen und Pendlern, die regelmäßig zwischen Wohnort und Arbeitsplatz pendeln
broad match: https://www.wikidata.org/wiki/Q110985381
related match: http://eurovoc.europa.eu/1910
broader: Wirtschaft

Kindertageseinrichtung - Standort
type: Concept
in scheme: Musterdatenkatalog
preferred label: nursery school - location @en
definition: Standorte von Einrichtungen, in denen Kinder ganztägig betreut werden
broad match: https://d-nb.info/gnd/4030638-0
broad match: https://www.wikidata.org/wiki/Q364005
broad match: http://eurovoc.europa.eu/630
broad match: https://schema.org/Preschool
editorial note: https://d-nb.info/gnd/4120801-8 (Niederlassung),
broader: Bildung

Termin
type: Concept
in scheme: Musterdatenkatalog
preferred label: appointment @en
definition: Termine und Öffnungszeiten von Einrichtungen der Kommunalverwaltung
broader: Bürgerservice

Verein
type: Concept
in scheme: Musterdatenkatalog
preferred label: association @en
definition: Informationen zu Vereinen in Kommunen
broad match: https://schema.org/Organization
broader: Freizeit

Verband
type: Concept
in scheme: Musterdatenkatalog
preferred label: association @en
definition: Zusammenschluss mehrerer kleinerer Vereinigungen oder Einzelpersonen zur Durchsetzung gemeinsamer Interessen
narrow match: https://d-nb.info/gnd/4027286-2
related match: http://eurovoc.europa.eu/2944
broad match: https://schema.org/Organization
broader: Politische Partizipation

Digitalisierung
type: Concept
in scheme: Musterdatenkatalog
top concept of: Musterdatenkatalog
narrower: Open Data - Planung
narrower: Open Data - Zugriffszahl
narrower: Website
narrower: WLAN und Mobilfunk
preferred label: digitalisation @en
definition: Digitale Transformation und Durchdringung aller Bereiche von Wirtschaft, Staat, Gesellschaft und Alltag
related: http://publications.europa.eu/resource/authority/data-theme/TECH

Bericht
type: Concept
in scheme: Musterdatenkatalog
preferred label: report @en
definition: Berichte über soziale Hilfestellungen
broad match: http://eurovoc.europa.eu/2891
broad match: https://schema.org/Report
broader: Soziale Hilfe

Bauvorhaben
type: Concept
in scheme: Musterdatenkatalog
preferred label: building project @en
definition: Gesamter Planungs- und Arbeitsprozess zum Herstellen oder Verändern eines Bauobjekts
broader: Bau

Quelle - Archivbestand
type: Concept
in scheme: Musterdatenkatalog
preferred label: source - archive collection @en
definition: Bestände kommunaler Archive
broad match: http://eurovoc.europa.eu/2492
broad match: https://schema.org/ArchiveOrganization
broader: Geschichte

Demografiebericht
type: Concept
in scheme: Musterdatenkatalog
preferred label: demographic report @en
definition: Bericht, der die demografische Entwicklung für Kommunen darstellt
broad match: https://www.wikidata.org/wiki/Q37732
related match: http://eurovoc.europa.eu/1773
related match: https://schema.org/StatisticalPopulation
broader: Bevölkerungsstruktur

Raumplanung
type: Concept
in scheme: Musterdatenkatalog
top concept of: Musterdatenkatalog
narrower: Bauleitplan
narrower: Bebauungsplan
narrower: Flächennutzung
narrower: Liegenschaft - Grundstück und Gebäude
narrower: Liegenschaft - Liegenschaftskataster
narrower: Liegenschaft - Satzung
narrower: Orthofoto
narrower: Raumgliederung - Adresse
narrower: Raumgliederung - Block
narrower: Raumgliederung - Hausnummer
narrower: Raumgliederung - Ortsteil
narrower: Raumgliederung - Postleitzahlengebiet
narrower: Raumgliederung - Stadtgebiet
narrower: Raumgliederung - Straße
narrower: Sozialraum
narrower: Stadtplan
preferred label: land use spatial planning regional development @en
definition: Daten zu Raumordnung, Raumplanung und Raumentwicklung
narrow match: https://d-nb.info/gnd/4048590-0
narrow match: https://www.wikidata.org/wiki/Q11420665
narrow match: http://eurovoc.europa.eu/1157
narrow match: https://schema.org/PlanAction
related: http://publications.europa.eu/resource/authority/data-theme/REGI

Bau
type: Concept
in scheme: Musterdatenkatalog
top concept of: Musterdatenkatalog
narrower: Baufertigstellung
narrower: Baugenehmigung
narrower: Bauvorhaben
narrower: Baustelle
narrower: Brunnen
narrower: Grundstücksbewertung
narrower: Tiefbau
narrower: Wohnungsbestand
preferred label: construction @en
definition: Bauen, Errichten, Herstellen
narrow match: https://d-nb.info/gnd/4056795-3
narrow match: http://eurovoc.europa.eu/3376
related: http://publications.europa.eu/resource/authority/data-theme/REGI

Baumbestand - Baumfällung
type: Concept
in scheme: Musterdatenkatalog
preferred label: tree population - tree logging @en
definition: Umschneiden von Bäumen
broad match: https://d-nb.info/gnd/4602392-6
broad match: https://www.wikidata.org/wiki/Q110543721
broad match: http://eurovoc.europa.eu/339
broader: Flora und Fauna

Energie
type: Concept
in scheme: Musterdatenkatalog
top concept of: Musterdatenkatalog
narrower: Energiebericht
narrower: Solar
narrower: Stromversorgung
narrower: Wärmeversorgung
narrower: Wasserversorgung
narrower: Windenergie
preferred label: energy @en
definition: Fähigkeit, mechanische Arbeit zu verrichten, Wärme abzugeben oder Licht auszustrahlen
related: http://publications.europa.eu/resource/authority/data-theme/ENER

Schule - Schulangebot
type: Concept
in scheme: Musterdatenkatalog
preferred label: school - school options @en
definition: Verzeichnisse der zur Verfügung stehenden Schulen bzw. deren Angebote
related match: https://d-nb.info/gnd/4300554-8
related match: https://www.wikidata.org/wiki/Q59261986
broad match: https://schema.org/School
editorial note: https://d-nb.info/gnd/4180229-9 (Schulwahl), http://eurovoc.europa.eu/3342 (Verzeichnis)
broader: Bildung

Wahl - Europawahl
type: Concept
in scheme: Musterdatenkatalog
preferred label: election - European election @en
definition: Wahleinrichtungen bzw. Wahlergebnisse der Europawahl
broad match: https://schema.org/VoteAction
broader: Politische Partizipation

Umweltzone
type: Concept
in scheme: Musterdatenkatalog
preferred label: low-emission zone @en
definition: Daten zu den in einer Kommune eingerichteten Gebieten, in denen nur Kfz mit Feinstaubplakette fahren dürfen
related match: https://schema.org/DefinedRegion
broader: Klimaschutz und Umweltschutz

Klimaschutz und Umweltschutz
type: Concept
in scheme: Musterdatenkatalog
top concept of: Musterdatenkatalog
narrower: Bericht und Analyse - Klimabilanz
narrower: Bericht und Analyse - Luft und Emission
narrower: Bericht und Analyse - Verkehrsmessung
narrower: Bericht und Analyse - Wasser
narrower: Radioaktivitätsmessung
narrower: Umweltzone
preferred label: climate protection and environmental protection @en
definition: Daten zu Witterung und Wettererscheinungen bzw. zum Schutz der natürlichen Umwelt
narrow match: https://d-nb.info/gnd/4031170-3
narrow match: https://www.wikidata.org/wiki/Q7937
narrow match: http://eurovoc.europa.eu/6011
related: http://publications.europa.eu/resource/authority/data-theme/ENVI

Wahl - Kandidatenliste
type: Concept
in scheme: Musterdatenkatalog
preferred label: election - list of candidates @en
definition: Wahlvorschläge der Kommunen
broad match: http://eurovoc.europa.eu/5105
broad match: https://schema.org/candidate
broader: Politische Partizipation

Gewässer - Pegelstand
type: Concept
in scheme: Musterdatenkatalog
preferred label: body of water - water level @en
definition: Wasserstände kommunaler Gewässer
broader: Flora und Fauna

Polizei
type: Concept
in scheme: Musterdatenkatalog
preferred label: police @en
definition: Standorte der Polizei
narrow match: https://schema.org/PoliceStation
broader: Sicherheit

Wahl - Straßenverzeichnis
type: Concept
in scheme: Musterdatenkatalog
preferred label: election - street directory @en
definition: Für Wahlen erstelltes Verzeichnis der Straßen und Plätze einer Kommune nach Stimmbezirk, Wahlbezirk, Wahlkreis
broad match: https://d-nb.info/gnd/4188171-0
broad match: https://www.wikidata.org/wiki/Q70326023
broad match: http://eurovoc.europa.eu/3342
narrow match: https://schema.org/streetAddress
broader: Politische Partizipation

Sozialraum
type: Concept
in scheme: Musterdatenkatalog
preferred label: social area @en
definition: Daten zu Sozialraum als Stadtplanungs- und Verwaltungskategorie
broader: Raumplanung

Justiz
type: Concept
in scheme: Musterdatenkatalog
top concept of: Musterdatenkatalog
narrower: Gesetzestext
narrower: Justizeinrichtung
preferred label: judicial system @en
definition: Für die Ausübung der Justiz verantwortliche Behörden und Einrichtungen
related match: http://eurovoc.europa.eu/5923
related: http://publications.europa.eu/resource/authority/data-theme/JUST

Unfall
type: Concept
in scheme: Musterdatenkatalog
preferred label: accident @en
definition: Verkehrsunfälle, Verkehrsunfallentwicklung
broader: Verkehr

Politische Vertretung - Mandatsträger
type: Concept
in scheme: Musterdatenkatalog
preferred label: political representation - elected official @en
definition: Informationen zu Mandatsträgerinnen und Mandatsträgern der Kommunen
broad match: https://schema.org/Person
broader: Politische Partizipation

ÖPNV - Fahrgastzahl
type: Concept
in scheme: Musterdatenkatalog
preferred label: public transportation - ridership @en
definition: Passagieraufkommen im kommunalen öffentlichen Personennahverkehr
related match: http://eurovoc.europa.eu/4511
broader: Verkehr

Abfallentsorgung
type: Concept
in scheme: Musterdatenkatalog
top concept of: Musterdatenkatalog
narrower: Abfallkalender
narrower: Abfallmenge
narrower: Abgabestelle
narrower: Container
narrower: Entwässerung
narrower: Müllgebühr
narrower: Straßenreinigung
preferred label: waste disposal @en
definition: Beseitigung von Müll
related match: https://schema.org/RecyclingCenter
related: http://publications.europa.eu/resource/authority/data-theme/ENVI

Flächennutzung
type: Concept
in scheme: Musterdatenkatalog
preferred label: land use @en
definition: Nutzung größerer Flächen einer Kommune für bestimmte Zwecke
broad match: http://eurovoc.europa.eu/4630
broad match: https://schema.org/PlanAction
broader: Raumplanung

Angebot und Beratungsstelle
type: Concept
in scheme: Musterdatenkatalog
preferred label: offer and counselling centre @en
definition: Verzeichnis des öffentlichen Angebotes sozialer Hilfen bzw. der Beratungsstellen
broader: Soziale Hilfe

Wahl - Bundestagswahl
type: Concept
in scheme: Musterdatenkatalog
preferred label: election - federal election @en
definition: Wahleinrichtungen bzw. Wahlergebnisse der Bundestagswahl
broad match: https://schema.org/VoteAction
broader: Politische Partizipation

Finanzielle Unterstützung - Förderung
type: Concept
in scheme: Musterdatenkatalog
preferred label: financial support - aid @en
definition: Finanzielle Unterstützungen im Rahmen der sozialen Hilfe
broad match: http://eurovoc.europa.eu/922
broader: Soziale Hilfe

Pressemitteilung und Veröffentlichung
type: Concept
in scheme: Musterdatenkatalog
preferred label: press release and publication @en
definition: Medienaussendungen und Pressemeldungen
narrow match: https://d-nb.info/gnd/4175659-9
narrow match: https://www.wikidata.org/wiki/Q207184
narrow match: http://eurovoc.europa.eu/31
narrow match: https://schema.org/Article
broader: Öffentlichkeitsarbeit

Schiffsverkehr und Fährverkehr - Passagier
type: Concept
in scheme: Musterdatenkatalog
preferred label: boat traffic and ferry traffic - passenger @en
definition: Fahrgäste
broader: Verkehr

Bürgerbeteiligung - Bürgerhaushalt
type: Concept
in scheme: Musterdatenkatalog
preferred label: public participation - participatory budgeting @en
definition: Direkte kommunale Bürgerbeteiligung, bei der die Bürgerinnen und Bürger über Teile der Haushaltsmittel mitbestimmen
broad match: https://d-nb.info/gnd/7505481-4
broad match: http://eurovoc.europa.eu/c_b007a1dc
broader: Politische Partizipation

Fläche - Jagdbezirk
type: Concept
in scheme: Musterdatenkatalog
preferred label: surface area - hunting district @en
definition: Kommunale Gebiete, in denen die Jagd ausgeübt wird
related match: http://eurovoc.europa.eu/5396
broader: Flora und Fauna

Müllgebühr
type: Concept
in scheme: Musterdatenkatalog
preferred label: waste disposal fee @en
definition: Entgelt für die Abfallentsorgung
broader: Abfallentsorgung

Schule - Schulentwicklungsplan
type: Concept
in scheme: Musterdatenkatalog
preferred label: school - school development plan @en
definition: Planungs- und Steuerungsinstrument für die Umsetzung schulischer Entwicklungsvorhaben
broad match: http://eurovoc.europa.eu/2393
broad match: https://schema.org/School
broader: Bildung

Volkshochschule - Teilnehmerzahl
type: Concept
in scheme: Musterdatenkatalog
preferred label: adult education centre - number of participants @en
definition: Anzahl der am Angebot der Erwachsenenbildungsinstitute teilnehmenden Personen
broad match: https://d-nb.info/gnd/4136151-9
broad match: http://eurovoc.europa.eu/5174
related match: https://schema.org/School
broader: Bildung

Sitzgelegenheit
type: Concept
in scheme: Musterdatenkatalog
preferred label: urban seating @en
definition: Sitzplätze im öffentlichen Raum
broad match: https://d-nb.info/gnd/4130809-8
broad match: https://www.wikidata.org/wiki/Q13397636
broad match: https://schema.org/SeatingMap
broader: Freizeit

KFZ - Carsharing
type: Concept
in scheme: Musterdatenkatalog
preferred label: motor vehicle - carsharing @en
definition: Standorte und Fahrzeuge des Carsharing-Angebots
related match: https://schema.org/AutoRental
broader: Verkehr

ÖPNV - Aufzug und Rolltreppe
type: Concept
in scheme: Musterdatenkatalog
preferred label: public transportation - elevators and escalators @en
definition: Rolltreppen und Aufzüge im öffentlichen Personennahverkehr
narrow match: https://d-nb.info/gnd/4129902-4
narrow match: https://www.wikidata.org/wiki/Q132911
narrow match: http://eurovoc.europa.eu/5447
editorial note: https://d-nb.info/gnd/4043176-9 (öffentlicher Personennahverkehr), https://www.wikidata.org/wiki/Q294362 (öffentlicher Personennahverkehr), https://www.wikidata.org/wiki/Q178512 (öffentlicher Verkehr), http://eurovoc.europa.eu/4512 (öffentlicher Verkehr)
broader: Verkehr

Stromversorgung
type: Concept
in scheme: Musterdatenkatalog
preferred label: electrical power supply @en
definition: Kennzahlen zur Stromversorgung in einer Kommune
broad match: https://schema.org/supply
broader: Energie

Container
type: Concept
in scheme: Musterdatenkatalog
preferred label: container @en
definition: Standorte der Großraumbehälter zur Sammlung, Zwischenlagerung und zum Transport von Müll
broad match: https://www.wikidata.org/wiki/Q987767
broad match: http://eurovoc.europa.eu/158
broader: Abfallentsorgung

Standort mit Geschichte
type: Concept
in scheme: Musterdatenkatalog
preferred label: site with a history @en
definition: Orte mit geschichtlicher Relevanz
broader: Geschichte

Ampelanlage
type: Concept
in scheme: Musterdatenkatalog
preferred label: traffic lights @en
definition: Standorte der Ampelanlagen
related match: http://eurovoc.europa.eu/847
broader: Verkehr

Flora und Fauna
type: Concept
in scheme: Musterdatenkatalog
top concept of: Musterdatenkatalog
narrower: Baumbestand - Baumfällung
narrower: Baumbestand - Baumkataster
narrower: Fläche - Ausgleichsfläche
narrower: Fläche - Biotopfläche
narrower: Fläche - Grünfläche und Grünflächenkataster
narrower: Fläche - Hundewiese
narrower: Fläche - Jagdbezirk
narrower: Fläche - Naturschutzgebiet
narrower: Fläche - Waldfläche
narrower: Gewässer - Pegelstand
narrower: Gewässer - Wasserfläche
narrower: Urban Gardening
preferred label: flora and fauna @en
definition: Pflanzen- und Tierwelt
narrow match: https://d-nb.info/gnd/4060087-7
narrow match: http://eurovoc.europa.eu/972
related: http://publications.europa.eu/resource/authority/data-theme/ENVI

Stadtmarketing
type: Concept
in scheme: Musterdatenkatalog
preferred label: city marketing @en
definition: Gesamtheit der Maßnahmen zur Imageförderung einer Stadt
broad match: http://eurovoc.europa.eu/13
broad match: https://schema.org/City
broader: Öffentlichkeitsarbeit

Friedhof - Standort
type: Concept
in scheme: Musterdatenkatalog
preferred label: cemetery - location @en
definition: Standorte der Friedhöfe
broad match: https://d-nb.info/gnd/4018537-0
broad match: https://www.wikidata.org/wiki/Q39614
broad match: http://eurovoc.europa.eu/5488
broad match: https://schema.org/Cemetery
broader: Kultur

Kultur
type: Concept
in scheme: Musterdatenkatalog
top concept of: Musterdatenkatalog
narrower: Denkmal
narrower: Friedhof - Grabstätte
narrower: Friedhof - Standort
narrower: religiöse Einrichtung
narrower: Kunstwerk
narrower: Lehrpfad und Wanderpfad
narrower: Museum - Besucherzahl
narrower: Museum - Standort
narrower: Theater - Besucherzahl
narrower: Theater - Programm
narrower: Veranstaltung - Angebot
narrower: Veranstaltung - Besucherzahl
preferred label: culture @en
definition: Daten zu Standort bzw. Angebot an geistigen, künstlerischen, gestaltenden Leistungen einer Kommune wie etwa Kunstwerke, Bauwerke (Museen, Theater, Denkmäler, Kirchen, Friedhöfe) usw.
narrow match: https://d-nb.info/gnd/7502136-5
narrow match: https://www.wikidata.org/wiki/Q778407
narrow match: https://schema.org/ExhibitionEvent
related: http://publications.europa.eu/resource/authority/data-theme/EDUC

Stadtführung
type: Concept
in scheme: Musterdatenkatalog
preferred label: guided city tour @en
definition: Informationen zu Stadtrundgängen und touristischen Führungen
related match: https://d-nb.info/gnd/4231341-7
related match: http://eurovoc.europa.eu/6768
broader: Tourismus

Schule - Schuleingangsuntersuchung
type: Concept
in scheme: Musterdatenkatalog
preferred label: school - School Entry Medical @en
definition: Gesetzlich vorgeschriebene Schulneulingsuntersuchung auf Einladung des Gesundheitsamtes vor der Aufnahme in die erste Jahrgangsstufe der Grundschule
related match: https://d-nb.info/gnd/4053474-1
related match: https://www.wikidata.org/wiki/Q3914
broad match: http://eurovoc.europa.eu/5307
broad match: https://schema.org/School
editorial note: https://www.wikidata.org/wiki/Q4287917 (medical examination), https://schema.org/PhysicalExam
broader: Bildung

Raumgliederung - Hausnummer
type: Concept
in scheme: Musterdatenkatalog
preferred label: space planning - house number @en
definition: Daten zu den Nummern der einzelnen Häuser
broad match: https://schema.org/Number
broader: Raumplanung

Open Data - Planung
type: Concept
in scheme: Musterdatenkatalog
preferred label: open data - planning @en
definition: Angaben zur Durchführung von Initiativen für offene Verwaltungsdaten
broad match: https://d-nb.info/gnd/1064023886
broad match: https://www.wikidata.org/wiki/Q309901
broad match: http://eurovoc.europa.eu/c_5ea6e5c4
broad match: https://schema.org/PlanAction
broader: Digitalisierung

Unterkunft - Hotel
type: Concept
in scheme: Musterdatenkatalog
preferred label: accommodation - hotel @en
definition: Standorte und Kontaktdetails der Hotelbetriebe
related match: http://eurovoc.europa.eu/1404
broader: Tourismus

Liegenschaft - Liegenschaftskataster
type: Concept
in scheme: Musterdatenkatalog
preferred label: real estate - real-estate register @en
definition: Daten zum Grundstücksverzeichnis
broad match: https://www.wikidata.org/wiki/Q191072
broader: Raumplanung

Haushalt - Außerplanmäßige Aufwendung
type: Concept
in scheme: Musterdatenkatalog
preferred label: budget - extraordinary expenditure @en
definition: Aufwendungen oder Auszahlungen, für die im Haushaltsplan keine Ermächtigungen veranschlagt und keine aus den Vorjahren übertragenen Ermächtigungen verfügbar sind
broad match: https://d-nb.info/gnd/4019962-9
broad match: https://www.wikidata.org/wiki/Q271855
broader: Finanzen

Anliegenmanagement
type: Concept
in scheme: Musterdatenkatalog
preferred label: citizen request management @en
definition: Systeme, mit denen Anliegen, Beschwerden, Hinweise und Wünsche von Nutzerinnen und Nutzern öffentlicher Dienste eingereicht werden
broad match: https://d-nb.info/gnd/4122813-3
editorial note: https://schema.org/CivicStructure, http://publications.europa.eu/resource/authority/customer-service/complaint
broader: Bürgerservice

Haushalt - Sponsoring
type: Concept
in scheme: Musterdatenkatalog
preferred label: budget - sponsoring @en
definition: Unterstützungen seitens der Kommunen durch finanzielle Mittel bzw. Sach- oder Dienstleistungen
broad match: https://d-nb.info/gnd/4207431-9
broad match: https://www.wikidata.org/wiki/Q10346136
broad match: http://eurovoc.europa.eu/5771
broad match: https://schema.org/sponsor
broader: Finanzen

Bericht und Analyse - Wasser
type: Concept
in scheme: Musterdatenkatalog
preferred label: report and analysis - water @en
definition: Kennzahlen zu Wasser in einer Kommune
narrow match: https://d-nb.info/gnd/4079058-7
narrow match: https://www.wikidata.org/wiki/Q632717
narrow match: http://eurovoc.europa.eu/1741
narrow match: https://schema.org/Report
broader: Klimaschutz und Umweltschutz

Solar
type: Concept
in scheme: Musterdatenkatalog
preferred label: solar energy @en
definition: Solarenergiekataster bzw. Angaben zur erzeugten Solarenergie
broad match: https://schema.org/Energy
broader: Energie

Liegenschaft - Satzung
type: Concept
in scheme: Musterdatenkatalog
preferred label: real estate - by-law @en
definition: Satzungen im Bereich Liegenschaften
broad match: http://eurovoc.europa.eu/1697
broad match: https://schema.org/Legislation
broader: Raumplanung

Wetter
type: Concept
in scheme: Musterdatenkatalog
top concept of: Musterdatenkatalog
narrower: Hitze
narrower: Messung
preferred label: weather @en
definition: Wetterdaten
related match: http://eurovoc.europa.eu/1892
related: http://publications.europa.eu/resource/authority/data-theme/ENVI

Flucht - Integration
type: Concept
in scheme: Musterdatenkatalog
preferred label: escape - integration @en
definition: Informationen zu den Angeboten der Flüchtlingshilfe
broader: Soziale Hilfe

Telefonverzeichnis
type: Concept
in scheme: Musterdatenkatalog
preferred label: telephone directory @en
definition: Telefonnummern von Mitarbeiterinnen und Mitarbeitern der Verwaltung
related match: https://www.wikidata.org/wiki/Q220393
broad match: http://eurovoc.europa.eu/3342
broad match: https://schema.org/telephone
broader: Bürgerservice

Behinderung - Behindertenwohnheim
type: Concept
in scheme: Musterdatenkatalog
preferred label: disability - residential care home for people with disabilities @en
definition: Einrichtungen für Menschen mit Behinderung
broad match: http://eurovoc.europa.eu/4209
broader: Soziale Hilfe

Bibliothek - Budget
type: Concept
in scheme: Musterdatenkatalog
preferred label: library - budget @en
definition: Finanzpläne von Bibliotheken
broad match: https://d-nb.info/gnd/4006439-6
broad match: https://www.wikidata.org/wiki/Q7075
broad match: http://eurovoc.europa.eu/4865
editorial note: https://d-nb.info/gnd/7505481-4 (kommunaler Haushaltsplan), http://eurovoc.europa.eu/2403 (Finanzplanung)
broader: Bildung

Religionszugehörigkeit
type: Concept
in scheme: Musterdatenkatalog
preferred label: religious affiliation @en
definition: Zugehörigkeit einer Person zu einer bestimmten Religionsgemeinschaft
broad match: https://d-nb.info/gnd/4512065-1
broad match: http://eurovoc.europa.eu/3257
narrow match: https://schema.org/Church
broader: Bevölkerungsstruktur

Wirtschaftsförderung
type: Concept
in scheme: Musterdatenkatalog
preferred label: business development @en
definition: Förderung der Wirtschaft durch Kommunen durch finanzielle oder andere Zuwendungen
narrow match: http://eurovoc.europa.eu/2804
editorial note: http://eurovoc.europa.eu/2803 (Absatzförderung)
broader: Wirtschaft

Radverkehr - Ladestation
type: Concept
in scheme: Musterdatenkatalog
preferred label: bicycle traffic - charging station @en
definition: E-Tankstellen zur Aufladung von Elektrofahrrädern
broad match: https://d-nb.info/gnd/1023745712
editorial note: https://d-nb.info/gnd/7857445-6 (Pedelec), https://www.wikidata.org/wiki/Q924724 (Elektrorad), https://www.wikidata.org/wiki/Q2066172 (E-Bike)
broader: Verkehr

Orthofoto
type: Concept
in scheme: Musterdatenkatalog
preferred label: orthophoto @en
definition: Verzerrungsfreie, maßstabsgetreue aus Luft- oder Satellitenbildern abgeleitete Abbildungen der Erdoberfläche
broad match: http://eurovoc.europa.eu/c_cdec6719
broad match: https://schema.org/Photograph
broader: Raumplanung

Öffentlichkeitsarbeit
type: Concept
in scheme: Musterdatenkatalog
top concept of: Musterdatenkatalog
narrower: Pressemitteilung und Veröffentlichung
narrower: Stadtmarketing
preferred label: public relations @en
definition: öffentliche Kommunikation
narrow match: https://schema.org/ReportageNewsArticle
related: http://publications.europa.eu/resource/authority/data-theme/GOVE

Bürgerbeteiligung - Entwicklung und Information
type: Concept
in scheme: Musterdatenkatalog
preferred label: public participation - development and information @en
definition: Information über und Weiterentwicklung der Bürgerbeteiligung
broad match: https://d-nb.info/gnd/4008767-0
broad match: http://eurovoc.europa.eu/c_b007a1dc
narrow match: https://www.wikidata.org/wiki/Q541936
broader: Politische Partizipation

Bericht und Analyse - Verkehrsmessung
type: Concept
in scheme: Musterdatenkatalog
preferred label: report and analysis - traffic count @en
definition: Kennzahlen zum Verkehrsaufkommen in einer Kommune
related match: http://eurovoc.europa.eu/3127
related match: https://schema.org/Vehicle
editorial note: https://d-nb.info/gnd/4522632-5 (Monitoring (Informatik))
broader: Klimaschutz und Umweltschutz

Hochschule - Standort
type: Concept
in scheme: Musterdatenkatalog
preferred label: university - location @en
definition: Standorte von Hochschulen
broad match: https://d-nb.info/gnd/4072560-1
broad match: https://www.wikidata.org/wiki/Q21028957
broad match: https://schema.org/CollegeOrUniversity
related match: http://eurovoc.europa.eu/4151
broader: Bildung

Sonstiges
type: Concept
in scheme: Musterdatenkatalog
top concept of: Musterdatenkatalog
narrower: Sonstiges
preferred label: miscellaneous @en
definition: Unter Sonstiges werden Daten eingeordnet, die nicht in die übrigen Kategorien passen. Im Zuge von Weiterentwicklungen könnten aus diesen Datensätzen neue Kategorien gebildet werden.

Flucht - Flüchtlingszahl
type: Concept
in scheme: Musterdatenkatalog
preferred label: escape - number of refugees @en
definition: Zahl der Flüchtlinge
broad match: https://d-nb.info/gnd/4017604-6
broad match: https://www.wikidata.org/wiki/Q131572
broad match: http://eurovoc.europa.eu/2986
broader: Soziale Hilfe

KFZ - Tankstelle
type: Concept
in scheme: Musterdatenkatalog
preferred label: motor vehicle - filling station @en
definition: Daten zu Tankstellen
broader: Verkehr

Arzt
type: Concept
in scheme: Musterdatenkatalog
preferred label: physician @en
definition: Daten zu den Ärztinnen und Ärzten
broader: Gesundheit

Abgabestelle
type: Concept
in scheme: Musterdatenkatalog
preferred label: collection point @en
definition: Ort, an dem bestimmte Müllkategorien abgegeben werden können
broad match: http://eurovoc.europa.eu/718
broader: Abfallentsorgung

Haushaltszusammensetzung
type: Concept
in scheme: Musterdatenkatalog
preferred label: household composition @en
definition: Personen, die in einer gemeinsamen Wohnung leben
broad match: https://d-nb.info/gnd/4023744-8
broad match: https://www.wikidata.org/wiki/Q259059
related match: http://eurovoc.europa.eu/1864
editorial note: http://data.europa.eu/bkc/014.04.01.1350 (households)
broader: Bevölkerungsstruktur

Einwohnerzahl
type: Concept
in scheme: Musterdatenkatalog
preferred label: population @en
definition: Gesamtzahl der Einwohnerinnen und Einwohner
broad match: http://eurovoc.europa.eu/2908
editorial note: https://www.wikidata.org/wiki/Q1613416
broader: Bevölkerungsstruktur

Kindertageseinrichtung - Betreuungsplatz
type: Concept
in scheme: Musterdatenkatalog
preferred label: nursery school - day care spot @en
definition: Zur Verfügung stehende Betreuungsplätze in Kindertagesstätten
broad match: https://d-nb.info/gnd/4030638-0
broad match: https://www.wikidata.org/wiki/Q364005
broad match: http://eurovoc.europa.eu/630
broad match: https://schema.org/Preschool
editorial note: https://d-nb.info/gnd/4030581-8 (Kindergarten), https://www.wikidata.org/wiki/Q12307014 (day care centre, no German), https://www.wikidata.org/wiki/Q126807 (Kindergarten), https://www.wikidata.org/wiki/Q364005 (Kindertagesstätte), https://www.wikidata.org/wiki/Q1076052 (Vorschule, English: nursery school, kindergarten)
broader: Bildung

Bericht und Analyse - Luft und Emission
type: Concept
in scheme: Musterdatenkatalog
preferred label: report and analysis - air and emissions @en
definition: Kennzahlen zu Luft- und Emissionswerten
narrow match: https://d-nb.info/gnd/4268743-3
narrow match: https://www.wikidata.org/wiki/Q989364
narrow match: http://eurovoc.europa.eu/2527
narrow match: https://schema.org/emissionsCO2
broader: Klimaschutz und Umweltschutz

religiöse Einrichtung
type: Concept
in scheme: Musterdatenkatalog
preferred label: religious institution @en
definition: Standorte bzw. Kennzahlen zu Sakralbauten, Gotteshäusern, Glaubenseinrichtungen
broad match: https://d-nb.info/gnd/4178936-2
broad match: https://www.wikidata.org/wiki/Q24398318
broad match: https://schema.org/PlaceOfWorship
narrow match: http://eurovoc.europa.eu/4101
editorial note: https://lobid.org/gnd/4184221-2 (Synagoge), https://lobid.org/gnd/4059416-6 (Tempel), https://lobid.org/gnd/4040320-8 (Moschee), https://d-nb.info/gnd/4029551-5 (Kapelle), https://d-nb.info/gnd/4031225-2 (Kloster), https://www.wikidata.org/wiki/Q34627 (Synagoge), https://www.wikidata.org/wiki/Q44539 (Tempel), https://www.wikidata.org/wiki/Q32815 (Moschee), https://www.wikidata.org/wiki/Q108325 (Kapelle), https://www.wikidata.org/wiki/Q44613 (Kloster), https://schema.org/Synagogue, https://schema.org/Mosque, https://schema.org/HinduTemple
broader: Kultur

Fläche - Hundewiese
type: Concept
in scheme: Musterdatenkatalog
preferred label: surface area - dog park @en
definition: Standorte der kommunalen Hundeauslaufgebiete
broad match: https://d-nb.info/gnd/4427915-2
broader: Flora und Fauna

Dienstleistung - Weihnachtsmarkt
type: Concept
in scheme: Musterdatenkatalog
preferred label: service - Christmas market @en
definition: Weihnachtsmärkte
broader: Wirtschaft

Wohnungsbestand
type: Concept
in scheme: Musterdatenkatalog
preferred label: residential portfolio @en
definition: Wohngebäudebestand, Gesamtzahl der in einem Gebiet an einem Stichtag vorhandenen Häuser und Wohnungen
broad match: https://www.wikidata.org/wiki/Q1247867
broader: Bau

Museum - Besucherzahl
type: Concept
in scheme: Musterdatenkatalog
preferred label: museum - number of visitors @en
definition: Frequentierungszahlen in Museen
broad match: https://d-nb.info/gnd/4040795-0
narrow match: https://www.wikidata.org/wiki/Q33506
broader: Kultur

Straßenreinigung
type: Concept
in scheme: Musterdatenkatalog
preferred label: street cleaning @en
definition: Reinigung öffentlicher Straßen und Plätze
editorial note: https://op.europa.eu/en/web/eu-vocabularies/concept/-/resource
broader: Abfallentsorgung

Flucht - Asylbewerber
type: Concept
in scheme: Musterdatenkatalog
preferred label: escape - asylum seeker @en
definition: Statistische Informationen zu Leistungsbeziehenden nach dem Asylbewerberleistungsgesetz
broader: Soziale Hilfe

Raumgliederung - Adresse
type: Concept
in scheme: Musterdatenkatalog
preferred label: space planning - address @en
definition: Daten zu Anschriften
broader: Raumplanung

Beschäftigung
type: Concept
in scheme: Musterdatenkatalog
preferred label: employment @en
definition: Statistische Daten zu Beschäftigung
related match: http://eurovoc.europa.eu/3537
related match: https://schema.org/employmentType
broader: Wirtschaft

Feuerwehr - Standort
type: Concept
in scheme: Musterdatenkatalog
preferred label: fire department - location @en
definition: Verzeichnis der Feuerwehrstandorte
broader: Sicherheit

Haushalt - Satzung
type: Concept
in scheme: Musterdatenkatalog
preferred label: budget - statutes @en
definition: Rechtsgrundlage für den Vollzug des Haushaltsplans in der kommunalen Verwaltung, der von der Gemeindevertretung oder dem Kreistag in öffentlicher Sitzung beschlossen wird
broad match: http://eurovoc.europa.eu/5050
broad match: https://schema.org/Legislation
broader: Finanzen

Quelle - Personalverzeichnis
type: Concept
in scheme: Musterdatenkatalog
preferred label: source - staff directory @en
definition: Kontaktliste kommunaler Mitarbeiterinnen und Mitarbeiter
broad match: https://d-nb.info/gnd/4188171-0
broad match: https://www.wikidata.org/wiki/Q70326023
broad match: http://eurovoc.europa.eu/3342
broad match: https://schema.org/ItemList
broader: Geschichte

ÖPNV - Vertriebsstelle
type: Concept
in scheme: Musterdatenkatalog
preferred label: public transportation - ticket sales point @en
definition: Standorte der Verkaufsstellen, Servicestellen und Fahrkartenautomaten im ÖPNV
related match: http://eurovoc.europa.eu/4464
narrow match: https://schema.org/Ticket
editorial note: https://d-nb.info/gnd/4704351-9 (Fahrkartenautomat), https://www.wikidata.org/wiki/Q657345 (Fahrkartenautomat), https://www.wikidata.org/wiki/Q47519615 (Vorverkaufsstelle)
broader: Verkehr

Fläche - Naturschutzgebiet
type: Concept
in scheme: Musterdatenkatalog
preferred label: surface area - nature reserve @en
definition: Kommunale Gebiete, die unter Naturschutz stehen
broader: Flora und Fauna

Sehenswürdigkeit
type: Concept
in scheme: Musterdatenkatalog
preferred label: tourist attraction @en
definition: Touristenattraktionen
broader: Tourismus

Brunnen
type: Concept
in scheme: Musterdatenkatalog
preferred label: fountain @en
definition: Brunnen und Teichfontänen
broader: Bau

Wahl - Wahlkreis und Wahlbezirk
type: Concept
in scheme: Musterdatenkatalog
preferred label: election - electoral district and precinct @en
definition: Daten zu Wahlkreisen und Wahlbezirken
broad match: https://d-nb.info/gnd/4188918-6
broad match: https://www.wikidata.org/wiki/Q192611
broad match: https://schema.org/AdministrativeArea
editorial note: http://eurovoc.europa.eu/363 (Wahlkreiseinteilung)
broader: Politische Partizipation

Schule - Schülerzahl
type: Concept
in scheme: Musterdatenkatalog
preferred label: school - number of students @en
definition: Anzahl der Schülerinnen und Schüler
broad match: https://schema.org/School
broader: Bildung

KFZ - Taxistand
type: Concept
in scheme: Musterdatenkatalog
preferred label: motor vehicle - taxicab station @en
definition: Standorte der Taxihalteplätze
broad match: https://d-nb.info/gnd/4059185-2
broad match: http://eurovoc.europa.eu/5927
broad match: https://schema.org/Taxi
broader: Verkehr

Unterkunft - Campingplatz
type: Concept
in scheme: Musterdatenkatalog
preferred label: accommodation - campsite @en
definition: Verzeichnis der Campingplätze
related match: http://eurovoc.europa.eu/5099
broader: Tourismus

Kunstwerk
type: Concept
in scheme: Musterdatenkatalog
preferred label: work of art @en
definition: Daten zu Erzeugnissen künstlerischen Schaffens im öffentlichen Raum der Kommunen
broad match: https://schema.org/CreativeWork
broader: Kultur

Wirtschaftsstandort
type: Concept
in scheme: Musterdatenkatalog
preferred label: business location @en
definition: Wirtschaftsrahmenbedingungen in einem bestimmten Gebiet
broad match: https://schema.org/location
broader: Wirtschaft

Fläche - Waldfläche
type: Concept
in scheme: Musterdatenkatalog
preferred label: surface area - forest area @en
definition: Bewaldete kommunale Gebiete
broad match: https://www.wikidata.org/wiki/Q4421
broader: Flora und Fauna

Rettungshilfe - Waldrettungspunkt
type: Concept
in scheme: Musterdatenkatalog
preferred label: rescue service - forest rescue point @en
definition: Waldstandorte für die Notfallalarmierung
broad match: https://d-nb.info/gnd/4231103-2
broad match: https://www.wikidata.org/wiki/Q1333922
broader: Sicherheit

Finanzielle Unterstützung - Wohngeld
type: Concept
in scheme: Musterdatenkatalog
preferred label: financial support - housing benefit @en
definition: Statistische Informationen zu Empfängerinnen und Empfängern von Wohngeld
broad match: http://eurovoc.europa.eu/826
broader: Soziale Hilfe

Grillplatz
type: Concept
in scheme: Musterdatenkatalog
preferred label: barbecue area @en
definition: Standorte öffentlicher Grillstellen
broader: Freizeit

Unterkunft - Herberge
type: Concept
in scheme: Musterdatenkatalog
preferred label: accommodation - hostel @en
definition: Informationen zu Beherbergungen
related match: http://eurovoc.europa.eu/1404
broader: Tourismus

Beleuchtung
type: Concept
in scheme: Musterdatenkatalog
preferred label: lighting @en
definition: Daten zur öffentlichen Beleuchtung
broader: Sicherheit

Messung
type: Concept
in scheme: Musterdatenkatalog
preferred label: weather measurements @en
definition: Wettermessdaten
related match: https://schema.org/QuantitativeValue
broader: Wetter

Bibliothek - Ausleihe
type: Concept
in scheme: Musterdatenkatalog
preferred label: library - circulation @en
definition: Verliehene Bibliotheksmedien
broad match: http://eurovoc.europa.eu/4865
broad match: https://schema.org/Library
broader: Bildung

Finanzen
type: Concept
in scheme: Musterdatenkatalog
top concept of: Musterdatenkatalog
narrower: Haushalt - Außerplanmäßige Aufwendung
narrower: Haushalt - Controlling
narrower: Haushalt - Jahresabschluss
narrower: Haushalt - Plan
narrower: Haushalt - Produktplan
narrower: Haushalt - Satzung
narrower: Haushalt - Sponsoring
narrower: Haushalt - Zuwendung und Förderung
narrower: Steuern und Abgaben
preferred label: finance @en
definition: Finanzielle Gebahrung einer Kommune
broad match: https://www.wikidata.org/wiki/Q274490
related: http://publications.europa.eu/resource/authority/data-theme/ECON

Quelle - Entschädigung
type: Concept
in scheme: Musterdatenkatalog
preferred label: source - restitution @en
definition: Kommunale Entschädigungsakten
broader: Geschichte

Wahl - Kommunalwahl
type: Concept
in scheme: Musterdatenkatalog
preferred label: election - municipal election @en
definition: Wahleinrichtungen bzw. Wahlergebnisse von Kommunalwahlen
broad match: https://schema.org/VoteAction
broader: Politische Partizipation

Zivilschutz und Katastrophenschutz - Sirene
type: Concept
in scheme: Musterdatenkatalog
preferred label: civil protection management and disaster management - siren @en
definition: Standorte der und Informationen zu Zivilschutzsirenen
broad match: http://eurovoc.europa.eu/3057
broader: Sicherheit

Fußverkehr - Laufstrecke und Wanderstrecke
type: Concept
in scheme: Musterdatenkatalog
preferred label: pedestrian traffic - running route and hiking route @en
definition: Strecken zum Laufen und Wandern in Kommunen
narrow match: https://d-nb.info/gnd/4590883-7
narrow match: https://www.wikidata.org/wiki/Q2143825
broader: Verkehr

Radverkehr - Radweg und Radroute
type: Concept
in scheme: Musterdatenkatalog
preferred label: bicycle traffic - bike path and cycle route @en
definition: Informationen zu Radwegen und Radrouten
narrow match: https://d-nb.info/gnd/4076489-8
narrow match: https://www.wikidata.org/wiki/Q102307360
editorial note: https://www.wikidata.org/wiki/Q221722 (Radschnellweg)
broader: Verkehr

Liegenschaft - Grundstück und Gebäude
type: Concept
in scheme: Musterdatenkatalog
preferred label: real estate - plot and building @en
definition: Daten zu kommunalen Liegenschaften
narrow match: https://d-nb.info/gnd/4072147-4
narrow match: https://www.wikidata.org/wiki/Q845132
narrow match: http://eurovoc.europa.eu/2815
related match: https://schema.org/House
editorial note: https://d-nb.info/gnd/4072130-9 (Grundeigentum)
broader: Raumplanung

Radioaktivitätsmessung
type: Concept
in scheme: Musterdatenkatalog
preferred label: radioactivity measurements @en
definition: Kennzahlen zu Radioaktivität in einer Kommune
broad match: https://d-nb.info/gnd/4048198-0
related match: https://www.wikidata.org/wiki/Q11448
related match: http://eurovoc.europa.eu/2882
related match: https://schema.org/measurementTechnique
editorial note: http://eurovoc.europa.eu/2539 (radioaktive Verseuchung)
broader: Klimaschutz und Umweltschutz

Städtisches Personal
type: Concept
in scheme: Musterdatenkatalog
top concept of: Musterdatenkatalog
narrower: Stellenausschreibung
narrower: Stellenplan
preferred label: city staff @en
definition: Informationen zu städtischem Personal, wie etwa zu Stellenangeboten und -plänen sowie Bewerber- und Besoldungsstatistiken
broad match: https://d-nb.info/gnd/4120744-0
broad match: http://eurovoc.europa.eu/2342
broad match: https://schema.org/employee
narrow match: https://www.wikidata.org/wiki/Q98058553
related: http://publications.europa.eu/resource/authority/data-theme/GOVE

Gewerbeanmeldung
type: Concept
in scheme: Musterdatenkatalog
preferred label: business registration @en
definition: Anmeldung der Ausübung eines Gewerbes bei der Behörde
broader: Wirtschaft

Hitze
type: Concept
in scheme: Musterdatenkatalog
preferred label: heat @en
definition: Hitzebelastung und Hitzeinseln im Stadtgebiet
editorial note: https://www.wikidata.org/wiki/Q215712 (städtische Wärmeinsel),
broader: Wetter

KFZ - Fahrzeugzulassung
type: Concept
in scheme: Musterdatenkatalog
preferred label: motor vehicle - vehicle registration @en
definition: Statistiken zur Straßenverkehrszulassung von Fahrzeugen
broader: Verkehr

Bebauungsplan
type: Concept
in scheme: Musterdatenkatalog
preferred label: zoning plan @en
definition: Kommunale Plänen, nach denen Flächen bebaut werden sollen
broad match: https://schema.org/PlanAction
broader: Raumplanung

Open Data - Zugriffszahl
type: Concept
in scheme: Musterdatenkatalog
preferred label: open data - click-through rate @en
definition: Zahl der Aufrufe von offenen Verwaltungsdaten
broad match: https://d-nb.info/gnd/1064023886
broad match: https://www.wikidata.org/wiki/Q309901
broad match: http://eurovoc.europa.eu/c_5ea6e5c4
broader: Digitalisierung

Beteiligung an Öffentlicher Wirtschaft - Beteiligung
type: Concept
in scheme: Musterdatenkatalog
preferred label: participation in public economy - shareholding @en
definition: Anteile der Kommunen an Unternehmen der Daseinsvorsorge
broad match: https://d-nb.info/gnd/4246829-2
broad match: http://eurovoc.europa.eu/2264
broader: Wirtschaft

Ausbildung
type: Concept
in scheme: Musterdatenkatalog
preferred label: education @en
definition: Ausbildungseinrichtungen
broad match: http://eurovoc.europa.eu/668
editorial note: https://schema.org/qualifications, https://schema.org/Course, https://schema.org/skills
broader: Bildung

Gesundheitsberichterstattung
type: Concept
in scheme: Musterdatenkatalog
preferred label: health reporting @en
definition: Kommunale Gesundheitsberichte
broad match: http://eurovoc.europa.eu/2891
broad match: https://schema.org/Report
broader: Gesundheit

Ordnungsamt
type: Concept
in scheme: Musterdatenkatalog
preferred label: public order office @en
definition: Informationen über die Tätigkeit der für die Abwehr von Gefahren für die öffentliche Sicherheit oder Ordnung verantwortliche Organisationseinheit der Kommunalverwaltung
broad match: http://eurovoc.europa.eu/2162
broader: Sicherheit

Radverkehr - Abstellplatz
type: Concept
in scheme: Musterdatenkatalog
preferred label: bicycle traffic - parking area @en
definition: Standorte der Fahrradstellplätze
broad match: https://schema.org/ParkingFacility
editorial note: https://www.wikidata.org/wiki/Q1392526 (Fahrradabstellanlage)
broader: Verkehr

Tiefbau
type: Concept
in scheme: Musterdatenkatalog
preferred label: underground construction @en
definition: Angaben zum Tätigkeitsbereich der Tiefbauämter
broad match: http://eurovoc.europa.eu/1145
broader: Bau

Fläche - Biotopfläche
type: Concept
in scheme: Musterdatenkatalog
preferred label: surface area - biotope area @en
definition: Verzeichnis der Biotope in den Kommunen
broad match: https://d-nb.info/gnd/4006907-2
broad match: https://www.wikidata.org/wiki/Q175208
broad match: http://eurovoc.europa.eu/5464
broader: Flora und Fauna

KFZ - Elektrotankstelle
type: Concept
in scheme: Musterdatenkatalog
preferred label: motor vehicle - electric filling station @en
definition: E-Tankstellen zur Aufladung von Elektrofahrzeugen
broader: Verkehr

Grundstücksbewertung
type: Concept
in scheme: Musterdatenkatalog
preferred label: property valuation @en
definition: Wertermittlung für bebaute und unbebaute Grundstücke und grundstücksgleiche Rechte (Immobilien)
narrow match: https://d-nb.info/gnd/4158416-8
related match: http://eurovoc.europa.eu/6786
editorial note: https://schema.org/House
broader: Bau

Gästezahl
type: Concept
in scheme: Musterdatenkatalog
preferred label: number of visitors @en
definition: Zahl der Gäste und Übernachtungen
related match: https://d-nb.info/gnd/4138535-4
related match: https://www.wikidata.org/wiki/Q112287562
broader: Tourismus

Bürgerbeteiligung - Bürgerentscheid
type: Concept
in scheme: Musterdatenkatalog
preferred label: public participation - local referendum @en
definition: Entscheidung einer wichtigen Angelegenheit der Kommune durch die Bürgerinnen und Bürger
broader: Politische Partizipation

Wahl - Verbundwahl
type: Concept
in scheme: Musterdatenkatalog
preferred label: election - simultaneous election @en
definition: Durch Zusammenlegung gleichzeitig stattfindende Wahlen
broad match: https://d-nb.info/gnd/4064286-0
broad match: https://www.wikidata.org/wiki/Q40231
broad match: http://eurovoc.europa.eu/695
broad match: https://schema.org/VoteAction
broader: Politische Partizipation

Flucht - Flüchtlingsunterbringung
type: Concept
in scheme: Musterdatenkatalog
preferred label: escape - refugee housing @en
definition: Entwicklung der Unterbringung von Flüchtlingen
narrow match: https://www.wikidata.org/wiki/Q19279682
related match: http://eurovoc.europa.eu/c_a2a3268e
related match: https://schema.org/Accommodation
broader: Soziale Hilfe

Jugendeinrichtung
type: Concept
in scheme: Musterdatenkatalog
preferred label: youth centre @en
definition: Standorte bzw. Angebote der Einrichtungen der kommunalen Jugendhilfe
broad match: http://eurovoc.europa.eu/847
broader: Freizeit

Zivilschutz und Katastrophenschutz - Kampfmittelfund
type: Concept
in scheme: Musterdatenkatalog
preferred label: civil protection management and disaster management - bomb disposal @en
definition: Daten zu Kampfmittelfunden und deren Beseitigung
related match: https://d-nb.info/gnd/1121326080
related match: https://www.wikidata.org/wiki/Q649416
broad match: http://eurovoc.europa.eu/3057
broader: Sicherheit

Haushalt - Jahresabschluss
type: Concept
in scheme: Musterdatenkatalog
preferred label: budget - annual financial statement @en
definition: Haushaltsrechnungen von Kommunen
broad match: https://d-nb.info/gnd/4162679-5
broad match: https://www.wikidata.org/wiki/Q192907
broad match: http://eurovoc.europa.eu/6013
broad match: https://schema.org/Report
broader: Finanzen

Website
type: Concept
in scheme: Musterdatenkatalog
preferred label: website @en
definition: Zugriffstatistiken der kommunalen Websites
broad match: https://d-nb.info/gnd/4596172-4
broad match: http://eurovoc.europa.eu/6775
broader: Digitalisierung

Ferienangebot
type: Concept
in scheme: Musterdatenkatalog
preferred label: school holiday programme @en
definition: Während der Schulferien angebotene Freizeitaktivitäten für Kinder und Jugendliche
broader: Freizeit

Finanzielle Unterstützung - Grundsicherung
type: Concept
in scheme: Musterdatenkatalog
preferred label: financial support - basic security @en
definition: Informationen zum Leistungsbezug der Grundsicherung
broader: Soziale Hilfe

Haushalt - Produktplan
type: Concept
in scheme: Musterdatenkatalog
preferred label: budget - product plan @en
definition: Von einer öffentlichen Verwaltung erstellter, verwaltungsspezifischer Gliederungsplan, der die Produktstruktur im Haushaltsplan festlegt
broad match: https://d-nb.info/gnd/7505481-4
broad match: https://schema.org/Product
broader: Finanzen

Gewässer - Wasserfläche
type: Concept
in scheme: Musterdatenkatalog
preferred label: body of water - water body @en
definition: Kommunale Gewässer
broader: Flora und Fauna

Sonstiges
type: Concept
in scheme: Musterdatenkatalog
preferred label: miscellaneous @en
definition: Unter Sonstiges werden Daten eingeordnet, die nicht in die übrigen Kategorien passen. Im Zuge von Weiterentwicklungen könnten aus diesen Datensätzen neue Kategorien gebildet werden.
broader: Sonstiges

Lehrpfad und Wanderpfad
type: Concept
in scheme: Musterdatenkatalog
preferred label: educational trail and hiking trail @en
definition: Daten zu Freizeitwegen inkl. gestalteten [Themen]wegen mit dem Ziel der Wissensvermittlung
narrow match: https://d-nb.info/gnd/4167190-9
narrow match: https://www.wikidata.org/wiki/Q1169870
editorial note: https://www.wikidata.org/wiki/Q2143825
broader: Kultur

Quelle - Historische Karte
type: Concept
in scheme: Musterdatenkatalog
preferred label: source - historical map @en
definition: Daten zu historischen Landkarten
broad match: http://eurovoc.europa.eu/7379
broad match: https://schema.org/Map
broader: Geschichte

Baustelle
type: Concept
in scheme: Musterdatenkatalog
preferred label: construction site @en
definition: Orte, an denen Bauwerke errichtet, umgebaut oder abgerissen werden
broader: Bau

Rettungshilfe - Notfallnummer
type: Concept
in scheme: Musterdatenkatalog
preferred label: rescue service - emergency number @en
definition: Öffentliche Orte, die mit Informationen zu Notfallnummern ausgestattet sind
related match: https://d-nb.info/gnd/4172076-3
broad match: http://eurovoc.europa.eu/881
broad match: https://schema.org/telephone
broader: Sicherheit

Radverkehr - Messung
type: Concept
in scheme: Musterdatenkatalog
preferred label: bicycle traffic - traffic count @en
definition: Standorte und Messergebnisse der Radzählstellen
broad match: https://d-nb.info/gnd/4187848-6
broad match: https://www.wikidata.org/wiki/Q361151
broad match: https://schema.org/Vehicle
broader: Verkehr

Politische Vertretung - Gremium
type: Concept
in scheme: Musterdatenkatalog
preferred label: political representation - committee @en
definition: Informationen zu den beschlussfassenden Ausschüssen der Kommunen
related match: http://eurovoc.europa.eu/5762
broader: Politische Partizipation

Dienstleistung - Postfiliale
type: Concept
in scheme: Musterdatenkatalog
preferred label: service - post office @en
definition: Filialen der Postdienste
broad match: http://eurovoc.europa.eu/4133
broader: Wirtschaft

Gesetzestext
type: Concept
in scheme: Musterdatenkatalog
preferred label: legal text @en
definition: Wortlaut eines Gesetzes
broad match: https://d-nb.info/gnd/4020660-9
broad match: https://www.wikidata.org/wiki/Q820655
broad match: https://schema.org/Legislation
editorial note: https://schema.org/text
broader: Justiz

Rettungsdienst - Rettungsdiensteinsatz
type: Concept
in scheme: Musterdatenkatalog
preferred label: emergency service - rescue mission @en
definition: Kennzahlen zu Einsätzen durch die kommunalen Rettungsdienste
narrow match: http://eurovoc.europa.eu/5938
related match: https://schema.org/EmergencyService
broader: Gesundheit